{"text_format":"1","workbook":"xlsx","n_sheets":6,"sheets":["Configuration","Mall","Overview","1_tes1","2_2","3_3"],"not_rendered":{"charts":6,"images":1,"macros":1,"external_links":0,"defined_names":4,"comments":0,"pivot_tables":0},"unopened":[],"bounds":{"document_bytes":16777216,"sheet_cells":100000,"rows_first":2000,"rows_last":500,"rows_between":2000,"halvings":0,"cell_chars":16384,"cell_head_chars":4096},"cells_cut":0,"cells_raw":0,"read":"whole","date_system":"1900"}

{"sheet":"Configuration","index":0,"n_rows":385,"n_cols":23,"rows_kept":385,"cut":false,"hidden":false,"merged":[]}
[{"$f":"2+G8","v":5},6,{"$f":"B1-3","v":3},{"$f":"4+G8","v":7},null,null,"Instructions ",null,null,null,null,null,null,null,null,null,null,"Configuration",null,null,"previous partners",3]
["Tomruta",3,{"$f":"IF(B2<$A$1,\"Show\",\"Hide\")","v":"Show"},null,null,null,"1. Insert the number of partners/affiliated entities and associated partners, project duration and number of WPs",null,null,null,null,null,null,null,null,null,null,"Mall",null,null,"previous WPs",6]
[{"$f":"L15","v":"1_tes1"},2,{"$f":"IF(B3<$A$1,\"Show\",\"Hide\")","v":"Show"},null,null,null,"2. Fill in the table below with partner name/country/organisation and type of applicant",null,null,null,null,null,null,null,null,null,null,"Overview"]
[{"$f":"L16","v":"2_2"},null,null,null,null,null,"3. Press \"Refresh\"  to create or delete sheets based on number of partners and the table below",null,null,null,null,null,null,null,null,null,null,{"$f":"A3","v":"1_tes1"}]
[{"$f":"L17","v":"3_3"},null,null,null,null,null,"4. When all sheets are created, resave this file as \".xlsx \" to get a macro free version to use/send to partners",null,null,null,null,null,null,null,null,null,null,{"$f":"A4","v":"2_2"}]
[4,3,{"$f":"IF(B6<$A$1,\"Show\",\"Hide\")","v":"Show"},null,null,null,null,null,null,null,null,null,null,null,null,null,null,"3_3",null,null,null,null,"Participant"]
[5,4,{"$f":"IF(B7<$A$1,\"Show\",\"Hide\")","v":"Show"},null,null,null,"Number of Partners",null,null,null,null,null,null,null,null,null,null,4,null,null,null,null,"Affiliated Entity"]
[6,5,"Hide",null,null,null,3,null,null,null,null,null,null,null,null,null,null,5,null,null,null,null,"Associated Partner"]
[7,6,1,null,null,null,null,null,null,null,null,null,null,null,null,null,null,6]
[8,7,"Hide",null,null,null,"Project duration",null,"Number of WorkPackages",null,null,null,null,null,null,null,null,7]
[9,8,"Hide",null,null,null,36,"Months",6,null,null,null,null,null,null,null,null,8]
[10,9,"Hide",null,null,null,null,null,null,null,null,null,null,null,null,null,null,9]
[11,10,"Hide",null,null,null,null,null,null,null,null,null,null,null,null,null,null,10]
[12,11,"Hide",null,null,null,"Number","Name ","Country ","Organisation type","Type of applicant","Name of partners",null,null,null,null,null,11]
[13,12,"Hide",99,1,1,{"$f":"IF(G$8+0.5>F15,F15,\"\")","v":1},"tes1",2,4,"Participant",{"$f":"IF(K15=\"Participant\",E15&\"_\"&LEFT(RemoveSpecChar(H15),20),IF(LEFT(RemoveSpecChar(H15),20)=$F$1,F15,LEFT(RemoveSpecChar(H15),20)))","v":"1_tes1"},{"$f":"IF(F15<$G$8+1,\"Show\",\"Hide\")","v":"Show"},null,null,null,null,12]
[14,13,"Hide",99,2,2,2,2,3,5,"Participant",{"$f":"IF(K16=\"Participant\",E16&\"_\"&LEFT(RemoveSpecChar(H16),20),IF(LEFT(RemoveSpecChar(H16),20)=$F$1,F16,LEFT(RemoveSpecChar(H16),20)))","v":"2_2"},"Show",null,null,null,null,13]
[15,14,"Hide",99,3,3,3,3,3,3,"Participant",{"$f":"IF(K17=\"Participant\",E17&\"_\"&LEFT(RemoveSpecChar(H17),20),IF(LEFT(RemoveSpecChar(H17),20)=$F$1,F17,LEFT(RemoveSpecChar(H17),20)))","v":"3_3"},"Show",null,null,null,null,14]
[16,15,"Hide",99,4,4,"",null,null,null,null,{"$f":"IF(K18=\"Participant\",E18&\"_\"&LEFT(RemoveSpecChar(H18),20),IF(LEFT(RemoveSpecChar(H18),20)=$F$1,F18,LEFT(RemoveSpecChar(H18),20)))","v":4},"Hide",null,null,null,null,15]
[17,16,"Hide",99,5,5,{"$f":"IF(G$8+0.5>F19,F19,\"\")","v":""},null,null,null,null,{"$f":"IF(K19=\"Participant\",E19&\"_\"&LEFT(RemoveSpecChar(H19),20),IF(LEFT(RemoveSpecChar(H19),20)=$F$1,F19,LEFT(RemoveSpecChar(H19),20)))","v":5},"Hide",null,null,null,null,16]
[18,17,"Hide",99,6,6,{"$f":"IF(G$8+0.5>F20,F20,\"\")","v":""},null,null,null,null,{"$f":"IF(K20=\"Participant\",E20&\"_\"&LEFT(RemoveSpecChar(H20),20),IF(LEFT(RemoveSpecChar(H20),20)=$F$1,F20,LEFT(RemoveSpecChar(H20),20)))","v":6},"Hide",null,null,null,null,17]
[19,18,"Hide",99,7,7,"",null,null,null,null,{"$f":"IF(K21=\"Participant\",E21&\"_\"&LEFT(RemoveSpecChar(H21),20),IF(LEFT(RemoveSpecChar(H21),20)=$F$1,F21,LEFT(RemoveSpecChar(H21),20)))","v":7},"Hide",null,null,null,null,18]
[20,19,"Hide",99,8,8,"",null,null,null,null,{"$f":"IF(K22=\"Participant\",E22&\"_\"&LEFT(RemoveSpecChar(H22),20),IF(LEFT(RemoveSpecChar(H22),20)=$F$1,F22,LEFT(RemoveSpecChar(H22),20)))","v":8},"Hide",null,null,null,null,19]
[21,20,"Hide",99,9,9,"",null,null,null,null,{"$f":"IF(K23=\"Participant\",E23&\"_\"&LEFT(RemoveSpecChar(H23),20),IF(LEFT(RemoveSpecChar(H23),20)=$F$1,F23,LEFT(RemoveSpecChar(H23),20)))","v":9},"Hide",null,null,null,null,20]
[22,21,"Hide",99,10,10,"",null,null,null,null,{"$f":"IF(K24=\"Participant\",E24&\"_\"&LEFT(RemoveSpecChar(H24),20),IF(LEFT(RemoveSpecChar(H24),20)=$F$1,F24,LEFT(RemoveSpecChar(H24),20)))","v":10},"Hide",null,null,null,null,21]
[23,22,"Hide",99,11,11,"",null,null,null,null,{"$f":"IF(K25=\"Participant\",E25&\"_\"&LEFT(RemoveSpecChar(H25),20),IF(LEFT(RemoveSpecChar(H25),20)=$F$1,F25,LEFT(RemoveSpecChar(H25),20)))","v":11},"Hide",null,null,null,null,22]
[24,23,"Hide",99,12,12,"",null,null,null,null,{"$f":"IF(K26=\"Participant\",E26&\"_\"&LEFT(RemoveSpecChar(H26),20),IF(LEFT(RemoveSpecChar(H26),20)=$F$1,F26,LEFT(RemoveSpecChar(H26),20)))","v":12},"Hide",null,null,null,null,23]
[25,24,"Hide",99,13,13,"",null,null,null,null,{"$f":"IF(K27=\"Participant\",E27&\"_\"&LEFT(RemoveSpecChar(H27),20),IF(LEFT(RemoveSpecChar(H27),20)=$F$1,F27,LEFT(RemoveSpecChar(H27),20)))","v":13},"Hide",null,null,null,null,24]
[26,25,"Hide",99,14,14,"",null,null,null,null,{"$f":"IF(K28=\"Participant\",E28&\"_\"&LEFT(RemoveSpecChar(H28),20),IF(LEFT(RemoveSpecChar(H28),20)=$F$1,F28,LEFT(RemoveSpecChar(H28),20)))","v":14},"Hide",null,null,null,null,25]
[27,26,"Hide",99,15,15,"",null,null,null,null,{"$f":"IF(K29=\"Participant\",E29&\"_\"&LEFT(RemoveSpecChar(H29),20),IF(LEFT(RemoveSpecChar(H29),20)=$F$1,F29,LEFT(RemoveSpecChar(H29),20)))","v":15},"Hide",null,null,null,null,26]
[28,27,"Hide",99,16,16,"",null,null,null,null,{"$f":"IF(K30=\"Participant\",E30&\"_\"&LEFT(RemoveSpecChar(H30),20),IF(LEFT(RemoveSpecChar(H30),20)=$F$1,F30,LEFT(RemoveSpecChar(H30),20)))","v":16},"Hide",null,null,null,null,27]
[29,28,"Hide",99,17,17,"",null,null,null,null,{"$f":"IF(K31=\"Participant\",E31&\"_\"&LEFT(RemoveSpecChar(H31),20),IF(LEFT(RemoveSpecChar(H31),20)=$F$1,F31,LEFT(RemoveSpecChar(H31),20)))","v":17},"Hide",null,null,null,null,28]
[30,29,"Hide",99,18,18,"",null,null,null,null,{"$f":"IF(K32=\"Participant\",E32&\"_\"&LEFT(RemoveSpecChar(H32),20),IF(LEFT(RemoveSpecChar(H32),20)=$F$1,F32,LEFT(RemoveSpecChar(H32),20)))","v":18},"Hide",null,null,null,null,29]
[31,30,"Hide",99,19,19,"",null,null,null,null,{"$f":"IF(K33=\"Participant\",E33&\"_\"&LEFT(RemoveSpecChar(H33),20),IF(LEFT(RemoveSpecChar(H33),20)=$F$1,F33,LEFT(RemoveSpecChar(H33),20)))","v":19},"Hide",null,null,null,null,30]
[32,31,"Hide",99,20,20,"",null,null,null,null,{"$f":"IF(K34=\"Participant\",E34&\"_\"&LEFT(RemoveSpecChar(H34),20),IF(LEFT(RemoveSpecChar(H34),20)=$F$1,F34,LEFT(RemoveSpecChar(H34),20)))","v":20},"Hide",null,null,null,null,31]
[33,32,"Hide",99,21,21,"",null,null,null,null,{"$f":"IF(K35=\"Participant\",E35&\"_\"&LEFT(RemoveSpecChar(H35),20),IF(LEFT(RemoveSpecChar(H35),20)=$F$1,F35,LEFT(RemoveSpecChar(H35),20)))","v":21},"Hide",null,null,null,null,32]
[34,33,"Hide",99,22,22,"",null,null,null,null,{"$f":"IF(K36=\"Participant\",E36&\"_\"&LEFT(RemoveSpecChar(H36),20),IF(LEFT(RemoveSpecChar(H36),20)=$F$1,F36,LEFT(RemoveSpecChar(H36),20)))","v":22},"Hide",null,null,null,null,33]
[35,34,"Hide",99,23,23,"",null,null,null,null,{"$f":"IF(K37=\"Participant\",E37&\"_\"&LEFT(RemoveSpecChar(H37),20),IF(LEFT(RemoveSpecChar(H37),20)=$F$1,F37,LEFT(RemoveSpecChar(H37),20)))","v":23},"Hide",null,null,null,null,34]
[36,35,"Hide",99,24,24,"",null,null,null,null,{"$f":"IF(K38=\"Participant\",E38&\"_\"&LEFT(RemoveSpecChar(H38),20),IF(LEFT(RemoveSpecChar(H38),20)=$F$1,F38,LEFT(RemoveSpecChar(H38),20)))","v":24},"Hide",null,null,null,null,35]
[37,36,"Hide",99,25,25,"",null,null,null,null,{"$f":"IF(K39=\"Participant\",E39&\"_\"&LEFT(RemoveSpecChar(H39),20),IF(LEFT(RemoveSpecChar(H39),20)=$F$1,F39,LEFT(RemoveSpecChar(H39),20)))","v":25},"Hide",null,null,null,null,36]
[38,37,"Hide",99,26,26,"",null,null,null,null,{"$f":"IF(K40=\"Participant\",E40&\"_\"&LEFT(RemoveSpecChar(H40),20),IF(LEFT(RemoveSpecChar(H40),20)=$F$1,F40,LEFT(RemoveSpecChar(H40),20)))","v":26},"Hide",null,null,null,null,37]
[39,38,"Hide",99,27,27,"",null,null,null,null,{"$f":"IF(K41=\"Participant\",E41&\"_\"&LEFT(RemoveSpecChar(H41),20),IF(LEFT(RemoveSpecChar(H41),20)=$F$1,F41,LEFT(RemoveSpecChar(H41),20)))","v":27},"Hide",null,null,null,null,38]
[40,39,"Hide",99,28,28,"",null,null,null,null,{"$f":"IF(K42=\"Participant\",E42&\"_\"&LEFT(RemoveSpecChar(H42),20),IF(LEFT(RemoveSpecChar(H42),20)=$F$1,F42,LEFT(RemoveSpecChar(H42),20)))","v":28},"Hide",null,null,null,null,39]
[41,40,"Hide",99,29,29,"",null,null,null,null,{"$f":"IF(K43=\"Participant\",E43&\"_\"&LEFT(RemoveSpecChar(H43),20),IF(LEFT(RemoveSpecChar(H43),20)=$F$1,F43,LEFT(RemoveSpecChar(H43),20)))","v":29},"Hide",null,null,null,null,40]
[42,41,"Hide",99,30,30,"",null,null,null,null,{"$f":"IF(K44=\"Participant\",E44&\"_\"&LEFT(RemoveSpecChar(H44),20),IF(LEFT(RemoveSpecChar(H44),20)=$F$1,F44,LEFT(RemoveSpecChar(H44),20)))","v":30},"Hide",null,null,null,null,41]
[43,42,"Hide",99,31,31,"",null,null,null,null,{"$f":"IF(K45=\"Participant\",E45&\"_\"&LEFT(RemoveSpecChar(H45),20),IF(LEFT(RemoveSpecChar(H45),20)=$F$1,F45,LEFT(RemoveSpecChar(H45),20)))","v":31},"Hide",null,null,null,null,42]
[44,43,"Hide",99,32,32,"",null,null,null,null,{"$f":"IF(K46=\"Participant\",E46&\"_\"&LEFT(RemoveSpecChar(H46),20),IF(LEFT(RemoveSpecChar(H46),20)=$F$1,F46,LEFT(RemoveSpecChar(H46),20)))","v":32},"Hide",null,null,null,null,43]
[45,44,"Hide",99,33,33,"",null,null,null,null,{"$f":"IF(K47=\"Participant\",E47&\"_\"&LEFT(RemoveSpecChar(H47),20),IF(LEFT(RemoveSpecChar(H47),20)=$F$1,F47,LEFT(RemoveSpecChar(H47),20)))","v":33},{"$f":"IF(F47<$G$8+1,\"Show\",\"Hide\")","v":"Hide"},null,null,null,null,44]
[46,45,"Hide",99,34,34,"",null,null,null,null,{"$f":"IF(K48=\"Participant\",E48&\"_\"&LEFT(RemoveSpecChar(H48),20),IF(LEFT(RemoveSpecChar(H48),20)=$F$1,F48,LEFT(RemoveSpecChar(H48),20)))","v":34},"Hide",null,null,null,null,45]
[47,46,"Hide",99,35,35,"",null,null,null,null,{"$f":"IF(K49=\"Participant\",E49&\"_\"&LEFT(RemoveSpecChar(H49),20),IF(LEFT(RemoveSpecChar(H49),20)=$F$1,F49,LEFT(RemoveSpecChar(H49),20)))","v":35},"Hide",null,null,null,null,46]
[48,47,"Hide",99,36,36,"",null,null,null,null,{"$f":"IF(K50=\"Participant\",E50&\"_\"&LEFT(RemoveSpecChar(H50),20),IF(LEFT(RemoveSpecChar(H50),20)=$F$1,F50,LEFT(RemoveSpecChar(H50),20)))","v":36},"Hide",null,null,null,null,47]
[49,48,"Hide",99,37,37,"",null,null,null,null,{"$f":"IF(K51=\"Participant\",E51&\"_\"&LEFT(RemoveSpecChar(H51),20),IF(LEFT(RemoveSpecChar(H51),20)=$F$1,F51,LEFT(RemoveSpecChar(H51),20)))","v":37},"Hide",null,null,null,null,48]
[50,49,"Hide",99,38,38,"",null,null,null,null,{"$f":"IF(K52=\"Participant\",E52&\"_\"&LEFT(RemoveSpecChar(H52),20),IF(LEFT(RemoveSpecChar(H52),20)=$F$1,F52,LEFT(RemoveSpecChar(H52),20)))","v":38},"Hide",null,null,null,null,49]
[51,50,"Hide",99,39,39,"",null,null,null,null,{"$f":"IF(K53=\"Participant\",E53&\"_\"&LEFT(RemoveSpecChar(H53),20),IF(LEFT(RemoveSpecChar(H53),20)=$F$1,F53,LEFT(RemoveSpecChar(H53),20)))","v":39},"Hide",null,null,null,null,50]
[52,51,"Hide",99,40,40,"",null,null,null,null,{"$f":"IF(K54=\"Participant\",E54&\"_\"&LEFT(RemoveSpecChar(H54),20),IF(LEFT(RemoveSpecChar(H54),20)=$F$1,F54,LEFT(RemoveSpecChar(H54),20)))","v":40},"Hide",null,null,null,null,51]
[53,52,"Hide",99,41,41,"",null,null,null,null,{"$f":"IF(K55=\"Participant\",E55&\"_\"&LEFT(RemoveSpecChar(H55),20),IF(LEFT(RemoveSpecChar(H55),20)=$F$1,F55,LEFT(RemoveSpecChar(H55),20)))","v":41},"Hide",null,null,null,null,52]
[54,53,"Hide",99,42,42,"",null,null,null,null,{"$f":"IF(K56=\"Participant\",E56&\"_\"&LEFT(RemoveSpecChar(H56),20),IF(LEFT(RemoveSpecChar(H56),20)=$F$1,F56,LEFT(RemoveSpecChar(H56),20)))","v":42},"Hide",null,null,null,null,53]
[55,54,"Hide",99,43,43,"",null,null,null,null,{"$f":"IF(K57=\"Participant\",E57&\"_\"&LEFT(RemoveSpecChar(H57),20),IF(LEFT(RemoveSpecChar(H57),20)=$F$1,F57,LEFT(RemoveSpecChar(H57),20)))","v":43},"Hide",null,null,null,null,54]
[56,55,"Hide",99,44,44,"",null,null,null,null,{"$f":"IF(K58=\"Participant\",E58&\"_\"&LEFT(RemoveSpecChar(H58),20),IF(LEFT(RemoveSpecChar(H58),20)=$F$1,F58,LEFT(RemoveSpecChar(H58),20)))","v":44},"Hide",null,null,null,null,55]
[57,56,"Hide",99,45,45,"",null,null,null,null,{"$f":"IF(K59=\"Participant\",E59&\"_\"&LEFT(RemoveSpecChar(H59),20),IF(LEFT(RemoveSpecChar(H59),20)=$F$1,F59,LEFT(RemoveSpecChar(H59),20)))","v":45},"Hide",null,null,null,null,56]
[58,57,"Hide",99,46,46,"",null,null,null,null,{"$f":"IF(K60=\"Participant\",E60&\"_\"&LEFT(RemoveSpecChar(H60),20),IF(LEFT(RemoveSpecChar(H60),20)=$F$1,F60,LEFT(RemoveSpecChar(H60),20)))","v":46},"Hide",null,null,null,null,57]
[59,58,"Hide",99,47,47,"",null,null,null,null,{"$f":"IF(K61=\"Participant\",E61&\"_\"&LEFT(RemoveSpecChar(H61),20),IF(LEFT(RemoveSpecChar(H61),20)=$F$1,F61,LEFT(RemoveSpecChar(H61),20)))","v":47},"Hide",null,null,null,null,58]
[60,59,"Hide",99,48,48,"",null,null,null,null,{"$f":"IF(K62=\"Participant\",E62&\"_\"&LEFT(RemoveSpecChar(H62),20),IF(LEFT(RemoveSpecChar(H62),20)=$F$1,F62,LEFT(RemoveSpecChar(H62),20)))","v":48},"Hide",null,null,null,null,59]
[61,60,"Hide",99,49,49,"",null,null,null,null,{"$f":"IF(K63=\"Participant\",E63&\"_\"&LEFT(RemoveSpecChar(H63),20),IF(LEFT(RemoveSpecChar(H63),20)=$F$1,F63,LEFT(RemoveSpecChar(H63),20)))","v":49},"Hide",null,null,null,null,60]
[62,61,"Hide",99,50,50,"",null,null,null,null,{"$f":"IF(K64=\"Participant\",E64&\"_\"&LEFT(RemoveSpecChar(H64),20),IF(LEFT(RemoveSpecChar(H64),20)=$F$1,F64,LEFT(RemoveSpecChar(H64),20)))","v":50},"Hide",null,null,null,null,61]
[63,62,"Hide",99,51,51,"",null,null,null,null,{"$f":"IF(K65=\"Participant\",E65&\"_\"&LEFT(RemoveSpecChar(H65),20),IF(LEFT(RemoveSpecChar(H65),20)=$F$1,F65,LEFT(RemoveSpecChar(H65),20)))","v":51},"Hide",null,null,null,null,62]
[64,63,"Hide",99,52,52,"",null,null,null,null,{"$f":"IF(K66=\"Participant\",E66&\"_\"&LEFT(RemoveSpecChar(H66),20),IF(LEFT(RemoveSpecChar(H66),20)=$F$1,F66,LEFT(RemoveSpecChar(H66),20)))","v":52},"Hide",null,null,null,null,63]
[65,64,"Hide",99,53,53,"",null,null,null,null,{"$f":"IF(K67=\"Participant\",E67&\"_\"&LEFT(RemoveSpecChar(H67),20),IF(LEFT(RemoveSpecChar(H67),20)=$F$1,F67,LEFT(RemoveSpecChar(H67),20)))","v":53},"Hide",null,null,null,null,64]
[66,65,"Hide",99,54,54,"",null,null,null,null,{"$f":"IF(K68=\"Participant\",E68&\"_\"&LEFT(RemoveSpecChar(H68),20),IF(LEFT(RemoveSpecChar(H68),20)=$F$1,F68,LEFT(RemoveSpecChar(H68),20)))","v":54},"Hide",null,null,null,null,65]
[{"$f":"L81","v":67},66,"Hide",99,55,55,"",null,null,null,null,{"$f":"IF(K69=\"Participant\",E69&\"_\"&LEFT(RemoveSpecChar(H69),20),IF(LEFT(RemoveSpecChar(H69),20)=$F$1,F69,LEFT(RemoveSpecChar(H69),20)))","v":55},"Hide",null,null,null,null,{"$f":"A68","v":66}]
[68,67,{"$f":"IF(B70<$A$1,\"Show\",\"Hide\")","v":"Hide"},99,56,56,"",null,null,null,null,{"$f":"IF(K70=\"Participant\",E70&\"_\"&LEFT(RemoveSpecChar(H70),20),IF(LEFT(RemoveSpecChar(H70),20)=$F$1,F70,LEFT(RemoveSpecChar(H70),20)))","v":56},"Hide",null,null,null,null,67]
[69,68,"Hide",99,57,57,"",null,null,null,null,{"$f":"IF(K71=\"Participant\",E71&\"_\"&LEFT(RemoveSpecChar(H71),20),IF(LEFT(RemoveSpecChar(H71),20)=$F$1,F71,LEFT(RemoveSpecChar(H71),20)))","v":57},"Hide",null,null,null,null,68]
[70,69,"Hide",99,58,58,"",null,null,null,null,{"$f":"IF(K72=\"Participant\",E72&\"_\"&LEFT(RemoveSpecChar(H72),20),IF(LEFT(RemoveSpecChar(H72),20)=$F$1,F72,LEFT(RemoveSpecChar(H72),20)))","v":58},"Hide",null,null,null,null,69]
[71,70,"Hide",99,59,59,"",null,null,null,null,{"$f":"IF(K73=\"Participant\",E73&\"_\"&LEFT(RemoveSpecChar(H73),20),IF(LEFT(RemoveSpecChar(H73),20)=$F$1,F73,LEFT(RemoveSpecChar(H73),20)))","v":59},"Hide",null,null,null,null,70]
[72,71,"Hide",99,60,60,"",null,null,null,null,{"$f":"IF(K74=\"Participant\",E74&\"_\"&LEFT(RemoveSpecChar(H74),20),IF(LEFT(RemoveSpecChar(H74),20)=$F$1,F74,LEFT(RemoveSpecChar(H74),20)))","v":60},"Hide",null,null,null,null,71]
[73,72,"Hide",99,61,61,"",null,null,null,null,{"$f":"IF(K75=\"Participant\",E75&\"_\"&LEFT(RemoveSpecChar(H75),20),IF(LEFT(RemoveSpecChar(H75),20)=$F$1,F75,LEFT(RemoveSpecChar(H75),20)))","v":61},"Hide",null,null,null,null,72]
[74,73,"Hide",99,62,62,"",null,null,null,null,{"$f":"IF(K76=\"Participant\",E76&\"_\"&LEFT(RemoveSpecChar(H76),20),IF(LEFT(RemoveSpecChar(H76),20)=$F$1,F76,LEFT(RemoveSpecChar(H76),20)))","v":62},"Hide",null,null,null,null,73]
[75,74,"Hide",99,63,63,"",null,null,null,null,{"$f":"IF(K77=\"Participant\",E77&\"_\"&LEFT(RemoveSpecChar(H77),20),IF(LEFT(RemoveSpecChar(H77),20)=$F$1,F77,LEFT(RemoveSpecChar(H77),20)))","v":63},"Hide",null,null,null,null,74]
[76,75,"Hide",99,64,64,"",null,null,null,null,{"$f":"IF(K78=\"Participant\",E78&\"_\"&LEFT(RemoveSpecChar(H78),20),IF(LEFT(RemoveSpecChar(H78),20)=$F$1,F78,LEFT(RemoveSpecChar(H78),20)))","v":64},"Hide",null,null,null,null,75]
[77,76,"Hide",99,65,65,"",null,null,null,null,{"$f":"IF(K79=\"Participant\",E79&\"_\"&LEFT(RemoveSpecChar(H79),20),IF(LEFT(RemoveSpecChar(H79),20)=$F$1,F79,LEFT(RemoveSpecChar(H79),20)))","v":65},{"$f":"IF(F79<$G$8+1,\"Show\",\"Hide\")","v":"Hide"},null,null,null,null,76]
[78,77,"Hide",99,66,66,"",null,null,null,null,{"$f":"IF(K80=\"Participant\",E80&\"_\"&LEFT(RemoveSpecChar(H80),20),IF(LEFT(RemoveSpecChar(H80),20)=$F$1,F80,LEFT(RemoveSpecChar(H80),20)))","v":66},"Hide",null,null,null,null,77]
[79,78,"Hide",99,67,67,"",null,null,null,null,{"$f":"IF(K81=\"Participant\",E81&\"_\"&LEFT(RemoveSpecChar(H81),20),IF(LEFT(RemoveSpecChar(H81),20)=$F$1,F81,LEFT(RemoveSpecChar(H81),20)))","v":67},"Hide",null,null,null,null,78]
[80,79,"Hide",99,68,68,"",null,null,null,null,{"$f":"IF(K82=\"Participant\",E82&\"_\"&LEFT(RemoveSpecChar(H82),20),IF(LEFT(RemoveSpecChar(H82),20)=$F$1,F82,LEFT(RemoveSpecChar(H82),20)))","v":68},"Hide",null,null,null,null,79]
[81,80,"Hide",99,69,69,"",null,null,null,null,{"$f":"IF(K83=\"Participant\",E83&\"_\"&LEFT(RemoveSpecChar(H83),20),IF(LEFT(RemoveSpecChar(H83),20)=$F$1,F83,LEFT(RemoveSpecChar(H83),20)))","v":69},"Hide",null,null,null,null,80]
[82,81,"Hide",99,70,70,{"$f":"IF(G$8+0.5>F84,F84,\"\")","v":""},null,null,null,null,{"$f":"IF(K84=\"Participant\",E84&\"_\"&LEFT(RemoveSpecChar(H84),20),IF(LEFT(RemoveSpecChar(H84),20)=$F$1,F84,LEFT(RemoveSpecChar(H84),20)))","v":70},"Hide",null,null,null,null,81]
[83,82,"Hide",99,71,71,"",null,null,null,null,{"$f":"IF(K85=\"Participant\",E85&\"_\"&LEFT(RemoveSpecChar(H85),20),IF(LEFT(RemoveSpecChar(H85),20)=$F$1,F85,LEFT(RemoveSpecChar(H85),20)))","v":71},"Hide",null,null,null,null,82]
[84,83,"Hide",99,72,72,"",null,null,null,null,{"$f":"IF(K86=\"Participant\",E86&\"_\"&LEFT(RemoveSpecChar(H86),20),IF(LEFT(RemoveSpecChar(H86),20)=$F$1,F86,LEFT(RemoveSpecChar(H86),20)))","v":72},"Hide",null,null,null,null,83]
[85,84,"Hide",99,73,73,"",null,null,null,null,{"$f":"IF(K87=\"Participant\",E87&\"_\"&LEFT(RemoveSpecChar(H87),20),IF(LEFT(RemoveSpecChar(H87),20)=$F$1,F87,LEFT(RemoveSpecChar(H87),20)))","v":73},"Hide",null,null,null,null,84]
[86,85,"Hide",99,74,74,"",null,null,null,null,{"$f":"IF(K88=\"Participant\",E88&\"_\"&LEFT(RemoveSpecChar(H88),20),IF(LEFT(RemoveSpecChar(H88),20)=$F$1,F88,LEFT(RemoveSpecChar(H88),20)))","v":74},"Hide",null,null,null,null,85]
[87,86,"Hide",99,75,75,"",null,null,null,null,{"$f":"IF(K89=\"Participant\",E89&\"_\"&LEFT(RemoveSpecChar(H89),20),IF(LEFT(RemoveSpecChar(H89),20)=$F$1,F89,LEFT(RemoveSpecChar(H89),20)))","v":75},"Hide",null,null,null,null,86]
[88,87,"Hide",99,76,76,"",null,null,null,null,{"$f":"IF(K90=\"Participant\",E90&\"_\"&LEFT(RemoveSpecChar(H90),20),IF(LEFT(RemoveSpecChar(H90),20)=$F$1,F90,LEFT(RemoveSpecChar(H90),20)))","v":76},"Hide",null,null,null,null,87]
[89,88,"Hide",99,77,77,"",null,null,null,null,{"$f":"IF(K91=\"Participant\",E91&\"_\"&LEFT(RemoveSpecChar(H91),20),IF(LEFT(RemoveSpecChar(H91),20)=$F$1,F91,LEFT(RemoveSpecChar(H91),20)))","v":77},"Hide",null,null,null,null,88]
[90,89,"Hide",99,78,78,"",null,null,null,null,{"$f":"IF(K92=\"Participant\",E92&\"_\"&LEFT(RemoveSpecChar(H92),20),IF(LEFT(RemoveSpecChar(H92),20)=$F$1,F92,LEFT(RemoveSpecChar(H92),20)))","v":78},"Hide",null,null,null,null,89]
[91,90,"Hide",99,79,79,"",null,null,null,null,{"$f":"IF(K93=\"Participant\",E93&\"_\"&LEFT(RemoveSpecChar(H93),20),IF(LEFT(RemoveSpecChar(H93),20)=$F$1,F93,LEFT(RemoveSpecChar(H93),20)))","v":79},"Hide",null,null,null,null,90]
[92,91,"Hide",99,80,80,"",null,null,null,null,{"$f":"IF(K94=\"Participant\",E94&\"_\"&LEFT(RemoveSpecChar(H94),20),IF(LEFT(RemoveSpecChar(H94),20)=$F$1,F94,LEFT(RemoveSpecChar(H94),20)))","v":80},"Hide",null,null,null,null,91]
[93,92,"Hide",99,81,81,"",null,null,null,null,{"$f":"IF(K95=\"Participant\",E95&\"_\"&LEFT(RemoveSpecChar(H95),20),IF(LEFT(RemoveSpecChar(H95),20)=$F$1,F95,LEFT(RemoveSpecChar(H95),20)))","v":81},"Hide",null,null,null,null,92]
[94,93,"Hide",99,82,82,"",null,null,null,null,{"$f":"IF(K96=\"Participant\",E96&\"_\"&LEFT(RemoveSpecChar(H96),20),IF(LEFT(RemoveSpecChar(H96),20)=$F$1,F96,LEFT(RemoveSpecChar(H96),20)))","v":82},"Hide",null,null,null,null,93]
[95,94,"Hide",99,83,83,"",null,null,null,null,{"$f":"IF(K97=\"Participant\",E97&\"_\"&LEFT(RemoveSpecChar(H97),20),IF(LEFT(RemoveSpecChar(H97),20)=$F$1,F97,LEFT(RemoveSpecChar(H97),20)))","v":83},"Hide",null,null,null,null,94]
[96,95,"Hide",99,84,84,"",null,null,null,null,{"$f":"IF(K98=\"Participant\",E98&\"_\"&LEFT(RemoveSpecChar(H98),20),IF(LEFT(RemoveSpecChar(H98),20)=$F$1,F98,LEFT(RemoveSpecChar(H98),20)))","v":84},"Hide",null,null,null,null,95]
[97,96,"Hide",99,85,85,"",null,null,null,null,{"$f":"IF(K99=\"Participant\",E99&\"_\"&LEFT(RemoveSpecChar(H99),20),IF(LEFT(RemoveSpecChar(H99),20)=$F$1,F99,LEFT(RemoveSpecChar(H99),20)))","v":85},"Hide",null,null,null,null,96]
[98,97,"Hide",99,86,86,"",null,null,null,null,{"$f":"IF(K100=\"Participant\",E100&\"_\"&LEFT(RemoveSpecChar(H100),20),IF(LEFT(RemoveSpecChar(H100),20)=$F$1,F100,LEFT(RemoveSpecChar(H100),20)))","v":86},"Hide",null,null,null,null,97]
[99,98,"Hide",99,87,87,"",null,null,null,null,{"$f":"IF(K101=\"Participant\",E101&\"_\"&LEFT(RemoveSpecChar(H101),20),IF(LEFT(RemoveSpecChar(H101),20)=$F$1,F101,LEFT(RemoveSpecChar(H101),20)))","v":87},"Hide",null,null,null,null,98]
[0,99,"Hide",99,88,88,"",null,null,null,null,{"$f":"IF(K102=\"Participant\",E102&\"_\"&LEFT(RemoveSpecChar(H102),20),IF(LEFT(RemoveSpecChar(H102),20)=$F$1,F102,LEFT(RemoveSpecChar(H102),20)))","v":88},"Hide",null,null,null,null,99]
[0,99,"Hide",99,89,89,"",null,null,null,null,{"$f":"IF(K103=\"Participant\",E103&\"_\"&LEFT(RemoveSpecChar(H103),20),IF(LEFT(RemoveSpecChar(H103),20)=$F$1,F103,LEFT(RemoveSpecChar(H103),20)))","v":89},"Hide"]
[0,null,null,99,90,90,{"$f":"IF($G$8>G103,G103+1,\"\")","v":""},null,null,null,null,{"$f":"IF(K104=\"Participant\",E104&\".\"&\" \"&H104, IF(H104=$F$1,F104,H104))","v":90},"Hide"]
[0,null,null,99,91,91,"",null,null,null,null,91,"Hide"]
[0,null,null,99,92,92,"",null,null,null,null,92,"Hide"]
[0,null,null,99,93,93,"",null,null,null,null,93,"Hide"]
[0,null,null,99,94,94,"",null,null,null,null,94,"Hide"]
[0,null,null,99,95,95,{"$f":"IF($G$8>G108,G108+1,\"\")","v":""},null,null,null,null,95,"Hide"]
[0,null,null,99,96,96,"",null,null,null,null,96,"Hide"]
[0,null,null,99,97,97,"",null,null,null,null,97,{"$f":"IF(F111<$G$8+1,\"Show\",\"Hide\")","v":"Hide"}]
[0,null,null,99,98,98,"",null,null,null,null,98,"Hide"]
[0,null,null,99,99,99,"",null,null,null,null,99,"Hide"]
[0,null,null,99,100,null,null,null,null,null,null,0,"Show"]
[0,null,null,99,101,null,null,null,null,null,null,0,"Show"]
[0,null,null,99,102,null,null,null,null,null,null,0,"Show"]
[0,null,null,99,103,null,null,null,null,null,null,0,"Show"]
[0,null,null,99,104,null,null,null,null,null,null,0,"Show"]
[0,null,null,99,105,null,null,null,null,null,null,0,"Show"]
[0,null,null,99]
[0,null,null,99]
[0,null,null,99]
[0,null,null,99]
[0,null,null,99]
[0,null,null,99]
[0,null,null,99]
[0,null,null,99]
[0,null,null,99]
[0,null,null,99]
[0,null,null,99]
[0,null,null,99]
[0,null,null,99]
[{"$f":"L145","v":0},null,null,99]
[0,null,null,99]
[0,null,null,99]
[0,null,null,99]
[0,null,null,99]
[0,null,null,99]
[0,null,null,99]
[0,null,null,99]
[0,null,null,99]
[0,null,null,99]
[0,null,null,99]
[0,null,null,99]
[0,null,null,99]
[0,null,null,99]
[0,null,null,99]
[0,null,null,99]
[null,null,null,99]
[null,null,null,99]
[null,null,null,99]
[null,null,null,99]
[null,null,null,99]
[null,null,null,99]
[null,null,null,99]
[null,null,null,99]
[null,null,null,99]
[null,null,null,99]
[null,null,null,99]
[null,null,null,99]
[null,null,null,99]
[null,null,null,99]
[null,null,null,99]
[null,null,null,99]
[null,null,null,99]
[null,null,null,99]
[null,null,null,99]
[null,null,null,99]
[null,null,null,99]
[null,null,null,99]
[null,null,null,99]
[null,null,null,99]
[null,null,null,99]
[null,null,null,99]
[null,null,null,99]
[null,null,null,99]
[null,null,null,99]
[null,null,null,99]
[null,null,null,99]
[null,null,null,99]
[null,null,null,99]
[null,null,null,99]
[null,null,null,99]
[null,null,null,99]
[null,null,null,99]
[null,null,null,99]
[null,null,null,99]
[null,null,null,99]
[null,null,null,99]
[null,null,null,99]
[null,null,null,99]
[null,null,null,99]
[null,null,null,99]
[null,null,null,99]
[null,null,null,99]
[null,null,null,99]
[null,null,null,99]
[null,null,null,99]
[null,null,null,99]
[null,null,null,99]
[null,null,null,99]
[null,null,null,99]
[null,null,null,99]
[null,null,null,99]
[null,null,null,99]
[null,null,null,99]
[null,null,null,99]
[null,null,null,99]
[null,null,null,99]
[null,null,null,99]
[null,null,null,99]
[null,null,null,99]
[null,null,null,99]
[null,null,null,99]
[null,null,null,99]
[null,null,null,99]
[null,null,null,99]
[null,null,null,99]
[null,null,null,99]
[null,null,null,99]
[null,null,null,99]
[null,null,null,99]
[null,null,null,99]
[null,null,null,99]
[null,null,null,99]
[null,null,null,99]
[null,null,null,99]
[null,null,null,99]
[null,null,null,99]
[null,null,null,99]
[null,null,null,99]
[null,null,null,99]
[null,null,null,99]
[null,null,null,99]
[null,null,null,99]
[null,null,null,99]
[null,null,null,99]
[null,null,null,99]
[null,null,null,99]
[null,null,null,99]
[null,null,null,99]
[null,null,null,99]
[null,null,null,99]
[null,null,null,99]
[null,null,null,99]
[null,null,null,99]
[null,null,null,99]
[null,null,null,99]
[null,null,null,99]
[null,null,null,99]
[null,null,null,99]
[null,null,null,99]
[null,null,null,99]
[null,null,null,99]
[null,null,null,99]
[null,null,null,99]
[null,null,null,99]
[null,null,null,99]
[null,null,null,99]
[null,null,null,99]
[null,null,null,99]
[null,null,null,99]
[null,null,null,99]
[null,null,null,99]
[null,null,null,99]
[null,null,null,99]
[null,null,null,99]
[null,null,null,99]
[null,null,null,99]
[null,null,null,99]
[null,null,null,99]
[null,null,null,99]
[null,null,null,99]
[null,null,null,99]
[null,null,null,99]
[null,null,null,99]
[null,null,null,99]
[null,null,null,99]
[null,null,null,99]
[null,null,null,99]
[null,null,null,99]
[null,null,null,99]
[null,null,null,99]
[null,null,null,99]
[null,null,null,99]
[null,null,null,99]
[null,null,null,99]
[null,null,null,99]
[null,null,null,99]
[null,null,null,99]
[null,null,null,99]
[null,null,null,99]
[null,null,null,99]
[null,null,null,99]
[null,null,null,99]
[null,null,null,99]
[null,null,null,99]
[null,null,null,99]
[null,null,null,99]
[null,null,null,99]
[null,null,null,99]
[null,null,null,99]
[null,null,null,99]
[null,null,null,99]
[null,null,null,99]
[null,null,null,99]
[null,null,null,99]
[null,null,null,99]
[null,null,null,99]
[null,null,null,99]
[null,null,null,99]
[null,null,null,99]
[null,null,null,99]
[null,null,null,99]
[null,null,null,99]
[null,null,null,99]
[null,null,null,99]
[null,null,null,99]
[null,null,null,99]
[null,null,null,99]
[null,null,null,99]
[null,null,null,99]
[null,null,null,99]
[null,null,null,99]
[null,null,null,99]
[null,null,null,99]
[null,null,null,99]
[null,null,null,99]
[null,null,null,99]
[null,null,null,99]
[null,null,null,99]
[null,null,null,99]
[null,null,null,99]
[null,null,null,99]
[null,null,null,99]
[null,null,null,99]
[null,null,null,99]
[null,null,null,99]
[null,null,null,99]
[null,null,null,99]
[null,null,null,99]
[null,null,null,99]
[null,null,null,99]
[null,null,null,99]
[null,null,null,99]
[null,null,null,99]
[null,null,null,99]
[null,null,null,99]
[null,null,null,99]
[null,null,null,99]
[null,null,null,99]
[null,null,null,99]
[null,null,null,99]
[null,null,null,99]
[null,null,null,99]
[null,null,null,99]
[null,null,null,99]
[null,null,null,99]
[null,null,null,99]
[null,null,null,99]
[null,null,null,99]
[null,null,null,99]
[null,null,null,99]
[null,null,null,99]
[null,null,null,99]
[null,null,null,99]
[null,null,null,99]
[null,null,null,99]
[null,null,null,99]
[null,null,null,99]
[null,null,null,99]
[null,null,null,99]
[null,null,null,99]
[null,null,null,99]
[null,null,null,99]
[null,null,null,99]
[null,null,null,99]
[null,null,null,99]
[null,null,null,99]
[null,null,null,99]
[null,null,null,99]
[null,null,null,99]
[null,null,null,99]
[null,null,null,99]
[null,null,null,99]

{"sheet":"Mall","index":1,"n_rows":165,"n_cols":21,"rows_kept":165,"cut":false,"hidden":true,"merged":[[144,20,144,35],[149,20,149,35],[150,20,150,35],[155,19,156,19],[145,17,145,18],[146,17,146,18],[147,17,147,18],[148,17,148,18],[150,17,150,18],[149,17,149,18],[151,17,151,18],[152,17,152,18],[153,17,153,18],[154,17,154,18],[142,17,142,18],[162,4,162,15],[163,4,163,15],[148,4,148,15],[149,4,149,15],[150,5,151,15],[155,17,156,18],[143,17,143,25],[145,20,145,35],[146,20,146,35],[147,20,147,35],[148,20,148,35],[151,20,151,35],[152,20,152,35],[153,20,153,35],[154,20,154,35],[1,5,2,11],[1,12,1,20],[2,12,2,16],[2,18,2,19],[2,20,7,20],[3,5,3,11],[3,12,3,16],[3,19,7,19],[4,10,4,11],[4,16,7,16],[5,7,6,11],[143,2,143,3],[145,4,145,15],[146,4,146,15],[118,2,119,2],[118,3,119,3],[118,12,119,12],[153,2,153,3],[160,2,160,3],[147,4,147,15],[156,4,156,15],[155,4,155,15],[3,2,4,3],[3,17,7,17],[3,18,7,18],[4,14,7,14],[4,15,7,15],[4,5,7,5],[4,6,7,6],[4,7,4,9],[4,12,7,12],[4,13,7,13],[120,1,139,1],[17,2,20,3],[118,10,119,10],[118,11,119,11],[118,4,118,9]]}
[{"$f":"Configuration!K16","v":"Participant"}]
[{"$f":"Configuration!G11","v":36},null,null,null,null,"Estimated expenditure",null,null,null,null,null,null,"Estimated Income"]
["J",null,null,null,null,null,null,null,null,null,null,null,"Requested EU contibution",null,null,null,null,"Revenues","Other cources of fincancing",null,"Total estimated income"]
["L",null,"Associated Partners can't request funding from HEU",null,null,"Estimated eligible costs",null,null,null,null,null,null,"EU contribution to eligible costs",null,null,null,null,"Income generated by the action","Financial contributions","Own resources"]
["M",null,null,null,null,"Personnel costs/€","Subcontracting costs/€","Purchase costs",null,null,"Other cost categories",null,"Indirect costs(€","Total eliqble costs","Funding rate","Maximun EU contribution to eliquble costs/€ (requested grant amount)","Requested EU contribution to eliqble costs/€ (requested grant amount)"]
[null,null,null,null,null,null,null,"Purchase costs"]
[]
[null,null,"No","Participant name","Country",null,null,"Travel and subsistence/€","Equipment/€","Other goods, works and services/€","Internal invoicing for goods and services","Finanical support to 3rd parties"]
[null,null,{"$f":"Configuration!F16","v":2},{"$f":"Configuration!H16","v":2},{"$f":"Configuration!I16","v":3},{"$f":"M141","v":0},{"$f":"D165","v":0},{"$f":"D146","v":0},{"$f":"D147","v":0},{"$f":"D150+D148+D149","v":0},{"$f":"D156","v":0},{"$f":"D157","v":0},{"$f":"0.25*(F9+H9+I9+J9)","v":0},{"$f":"F9+G9+H9+I9+J9+K9+M9","v":0},1,{"$f":"O9*N9","v":0},null,null,null,null,{"$f":"Q9+R9+S9+T9","v":0}]
[]
[null,null,null,null,null,null,null,null,null,null,null,null,null,null,"Remember to  update the following fields"]
[null,null,null,null,null,null,null,null,null,null,null,null,null,null,"* Funding rate"]
[null,null,null,null,null,null,null,null,null,null,null,null,null,null,"* Requested EU contribution"]
[null,null,null,null,null,null,null,null,null,null,null,null,null,null,"* Income Generated by the action"]
[null,null,null,null,null,null,null,null,null,null,null,null,null,null,"* Own resources"]
[]
[]
[null,null,"Personnel costs/€"]
[]
[]
[]
[]
[]
[]
[]
[]
[]
[]
[]
[]
[]
[]
[]
[]
[]
[]
[]
[]
[]
[]
[]
[]
[]
[]
[]
[]
[]
[]
[]
[]
[]
[]
[]
[]
[]
[]
[]
[]
[]
[]
[]
[]
[]
[]
[]
[]
[]
[]
[]
[]
[]
[]
[]
[]
[]
[]
[]
[]
[]
[]
[]
[]
[]
[]
[]
[]
[]
[]
[]
[]
[]
[]
[]
[]
[]
[]
[]
[]
[]
[]
[]
[]
[]
[]
[]
[]
[]
[]
[]
[]
[]
[]
[]
[]
[]
[]
[]
[]
[null,null,"Type pf Personnel","Direct cost /month (€)","Work Packages",null,null,null,null,null,"No of Person-months","Activity in project (%)","Total Cost (€)"]
[null,null,null,null,"WP 1","WP 2","WP 3","WP 4","WP 5","WP 6"]
[null,"Please change these example \"Type of personnel\"","Person 1 - PhD",null,null,null,null,null,null,null,{"$f":"SUM(E121:J121)","v":0},{"$f":"SUM(E121:J121)/$A$2","v":0},{"$f":"D121*K121","v":0}]
[null,null,"Person 2 - PhD",null,null,null,null,null,null,null,{"$f":"SUM(E122:J122)","v":0},{"$f":"SUM(E122:J122)/$A$2","v":0},{"$f":"D122*K122","v":0}]
[null,null,"Person 3 - PostDoc",null,null,null,null,null,null,null,{"$f":"SUM(E123:J123)","v":0},{"$f":"SUM(E123:J123)/$A$2","v":0},{"$f":"D123*K123","v":0}]
[null,null,"Person 4 - Researcher",null,null,null,null,null,null,null,{"$f":"SUM(E124:J124)","v":0},{"$f":"SUM(E124:J124)/$A$2","v":0},{"$f":"D124*K124","v":0}]
[null,null,"Person 5 - Professor",null,null,null,null,null,null,null,{"$f":"SUM(E125:J125)","v":0},{"$f":"SUM(E125:J125)/$A$2","v":0},{"$f":"D125*K125","v":0}]
[null,null,"Person 6 - Admin ",null,null,null,null,null,null,null,{"$f":"SUM(E126:J126)","v":0},{"$f":"SUM(E126:J126)/$A$2","v":0},{"$f":"D126*K126","v":0}]
[null,null,"Person 7- 2nd personell from 3rd party",null,null,null,null,null,null,null,{"$f":"SUM(E127:J127)","v":0},{"$f":"SUM(E127:J127)/$A$2","v":0},{"$f":"D127*K127","v":0}]
[null,null,null,null,null,null,null,null,null,null,{"$f":"SUM(E128:J128)","v":0},{"$f":"SUM(E128:J128)/$A$2","v":0},{"$f":"D128*K128","v":0}]
[null,null,null,null,null,null,null,null,null,null,{"$f":"SUM(E129:J129)","v":0},{"$f":"SUM(E129:J129)/$A$2","v":0},{"$f":"D129*K129","v":0}]
[null,null,null,null,null,null,null,null,null,null,{"$f":"SUM(E130:J130)","v":0},{"$f":"SUM(E130:J130)/$A$2","v":0},{"$f":"D130*K130","v":0}]
[null,null,null,null,null,null,null,null,null,null,{"$f":"SUM(E131:J131)","v":0},{"$f":"SUM(E131:J131)/$A$2","v":0},{"$f":"D131*K131","v":0}]
[null,null,null,null,null,null,null,null,null,null,{"$f":"SUM(E132:J132)","v":0},{"$f":"SUM(E132:J132)/$A$2","v":0},{"$f":"D132*K132","v":0}]
[null,null,null,null,null,null,null,null,null,null,{"$f":"SUM(E133:J133)","v":0},{"$f":"SUM(E133:J133)/$A$2","v":0},{"$f":"D133*K133","v":0}]
[null,null,null,null,null,null,null,null,null,null,{"$f":"SUM(E134:J134)","v":0},{"$f":"SUM(E134:J134)/$A$2","v":0},{"$f":"D134*K134","v":0}]
[null,null,null,null,null,null,null,null,null,null,{"$f":"SUM(E135:J135)","v":0},{"$f":"SUM(E135:J135)/$A$2","v":0},{"$f":"D135*K135","v":0}]
[null,null,null,null,null,null,null,null,null,null,{"$f":"SUM(E136:J136)","v":0},{"$f":"SUM(E136:J136)/$A$2","v":0},{"$f":"D136*K136","v":0}]
[null,null,null,null,null,null,null,null,null,null,{"$f":"SUM(E137:J137)","v":0},{"$f":"SUM(E137:J137)/$A$2","v":0},{"$f":"D137*K137","v":0}]
[null,null,null,null,null,null,null,null,null,null,{"$f":"SUM(E138:J138)","v":0},{"$f":"SUM(E138:J138)/$A$2","v":0},{"$f":"D138*K138","v":0}]
[null,null,null,null,null,null,null,null,null,null,{"$f":"SUM(E139:J139)","v":0},{"$f":"SUM(E139:J139)/$A$2","v":0},{"$f":"D139*K139","v":0}]
[null,null,null,null,null,null,null,null,null,null,{"$f":"SUM(E140:J140)","v":0},{"$f":"SUM(E140:J140)/$A$2","v":0},{"$f":"D140*K140","v":0}]
[null,null,"Total Personnel Costs",{"$f":"SUM(D121:D140)","v":0},{"$f":"SUM(E121:E140)","v":0},{"$f":"SUM(F121:F140)","v":0},{"$f":"SUM(G121:G140)","v":0},{"$f":"SUM(H121:H140)","v":0},{"$f":"SUM(I121:I140)","v":0},{"$f":"SUM(J121:J140)","v":0},{"$f":"SUM(K121:K140)","v":0},{"$f":"SUM(L121:L140)","v":0},{"$f":"SUM(M121:M140)","v":0}]
[]
[null,null,null,null,null,null,null,null,null,null,null,null,null,null,null,null,null,"Table 3.1 justification"]
[null,null,"Other direct  costs  (in €)    ",null,null,null,null,null,null,null,null,null,null,null,null,null,null,"List the the costs starting with the largest intil the remaining costs are below 15% of personel costs"]
[null,null,null,null,null,null,null,null,null,null,null,null,null,null,null,null,null,null,null,"Cost","Justification"]
[null,null,"Travel ",null,"Describe the costs",null,null,null,null,null,null,null,null,null,null,null,null,1]
[null,null,"Equipment",null,"Describe the costs",null,null,null,null,null,null,null,null,null,null,null,null,2]
[null,null,"Consumables",null,"Describe the costs",null,null,null,null,null,null,null,null,null,null,null,null,3]
[null,null,"Publications",null,"Describe the costs",null,null,null,null,null,null,null,null,null,null,null,null,4]
[null,null,"Other goods and services (incl audit)",null,"Describe the costs",null,null,null,null,null,null,null,null,null,null,null,null,5]
[null,null,"Total Other direct costs ",{"$f":"SUM(D146:D150)","v":0},{"$f":"IF($M$141>0,(SUM($D$146:$D$150)/$M$141),0)","v":0},"If the cost of other direct costs excede 15% of the total personnel costs this will need justification in part B of the proposal (table 3.1h)",null,null,null,null,null,null,null,null,null,null,null,6]
[null,null,null,null,null,null,null,null,null,null,null,null,null,null,null,null,null,7]
[null,null,null,null,null,null,null,null,null,null,null,null,null,null,null,null,null,8]
[null,null,"Other cost categories (in €)    ",null,null,null,null,null,null,null,null,null,null,null,null,null,null,9]
[null,null,null,null,null,null,null,null,null,null,null,null,null,null,null,null,null,10]
[null,null,"Internal invoicing for goods and services",null,"Describe the costs",null,null,null,null,null,null,null,null,null,null,null,null,"Remaining % total other direct costs",null,{"$f":"(D151-SUM(T146:T151))/M141","v":{"$error":"#DIV/0!"}}]
[null,null,"Finanical support to 3rd parties",null,"Describe the costs"]
[null,null,"Total ",{"$f":"SUM(D156:D157)","v":0}]
[]
[]
[null,null,"Direct costs of subcontracting (in €)    "]
[]
[null,null,"Subcontractor1",null,"Describe the costs"]
[null,null,"Subcontractor2",null,"Describe the costs"]
[null,null,"Total ",{"$f":"SUM(D163:D164)","v":0}]

{"sheet":"Overview","index":2,"n_rows":501,"n_cols":30,"rows_kept":501,"cut":false,"hidden":false,"merged":[[5,4,6,9],[117,3,117,5],[11,6,12,15],[11,16,11,21],[12,16,12,17],[12,19,12,20],[12,21,17,21],[13,6,13,15],[13,16,13,17],[13,18,17,18],[13,19,17,19],[13,20,17,20],[14,6,17,6],[14,15,17,15],[14,16,17,16],[14,7,17,7],[14,23,14,28],[14,8,14,10],[14,11,14,12],[14,13,17,13],[14,14,17,14],[14,17,17,17]]}
[{"$f":"Configuration!K17","v":"Participant"}]
[{"$f":"Configuration!G11","v":36}]
["AC"]
["AD"]
[]
[null,null,null,null,"All changes are to be done on the corresponding partner page"]
["K"]
[]
[null,null,3]
[]
[]
[null,null,null,null,null,null,"Estimated expenditure",null,null,null,null,null,null,null,null,null,"Estimated Income"]
[null,null,null,null,null,null,null,null,null,null,null,null,null,null,null,null,"Requested EU contibution",null,"Revenues","Other cources of fincancing",null,"Total estimated income"]
[null,null,null,null,null,null,"Estimated eligible costs",null,null,null,null,null,null,null,null,null,"EU contribution to eligible costs",null,"Income generated by the action","Financial contributions","Own resources"]
[null,null,null,null,null,null,"Personnel costs/€","Subcontracting costs/€","Purchase costs",null,null,"Other cost categories",null,"Indirect costs(€","Total eliqble costs","Funding rate","Maximun EU contribution to eliquble costs/€ (requested grant amount)","Requested EU contribution to eliqble costs/€ (requested grant amount)",null,null,null,null,null,"Work Packages"]
[]
[null,null,null,null,null,null,null,null,"Purchase costs"]
[null,null,null,"No","Participant name","Country",null,null,"Travel and subsistence/€","Equipment/€","Other goods, works and services/€","Internal invoicing for goods and services","Finanical support to 3rd parties",null,null,null,null,null,null,null,null,null,null,"WP 1","WP 2","WP 3","WP 4","WP 5","WP 6","Total PM"]
[4,{"$f":"IF(Configuration!G15=Configuration!F15,99,0)","v":99},null,{"$f":"IF(ISBLANK(Configuration!G15),\"\",Configuration!G15)","v":1},{"$f":"IF(ISBLANK(Configuration!H15),\"\",Configuration!H15)","v":"tes1"},{"$f":"IF(ISBLANK(Configuration!I15),\"\",Configuration!I15)","v":2},{"$f":"'1_tes1'!F9","v":800},{"$f":"'1_tes1'!G9","v":0},{"$f":"'1_tes1'!H9","v":90000},{"$f":"'1_tes1'!I9","v":0},{"$f":"'1_tes1'!J9","v":0},{"$f":"'1_tes1'!K9","v":0},{"$f":"'1_tes1'!L9","v":0},{"$f":"'1_tes1'!M9","v":22700},{"$f":"'1_tes1'!N9","v":113500},{"$f":"'1_tes1'!O9","v":1},{"$f":"'1_tes1'!P9","v":113500},{"$f":"'1_tes1'!Q9","v":0},{"$f":"'1_tes1'!R9","v":0},{"$f":"'1_tes1'!S9","v":0},{"$f":"'1_tes1'!T9","v":0},{"$f":"'1_tes1'!U9","v":0},null,{"$f":"'1_tes1'!E141","v":1},{"$f":"'1_tes1'!F141","v":2},{"$f":"'1_tes1'!G141","v":0},{"$f":"'1_tes1'!H141","v":5},{"$f":"'1_tes1'!I141","v":0},{"$f":"'1_tes1'!J141","v":0},{"$f":"SUM(X19:AC19)","v":8}]
[5,{"$f":"IF(Configuration!G16=Configuration!F16,99,0)","v":99},null,{"$f":"IF(ISBLANK(Configuration!G16),\"\",Configuration!G16)","v":2},{"$f":"IF(ISBLANK(Configuration!H16),\"\",Configuration!H16)","v":2},{"$f":"IF(ISBLANK(Configuration!I16),\"\",Configuration!I16)","v":3},{"$f":"'2_2'!F9","v":0},{"$f":"'2_2'!G9","v":0},{"$f":"'2_2'!H9","v":0},{"$f":"'2_2'!I9","v":0},{"$f":"'2_2'!J9","v":0},{"$f":"'2_2'!K9","v":0},{"$f":"'2_2'!L9","v":0},{"$f":"'2_2'!M9","v":0},{"$f":"'2_2'!N9","v":0},{"$f":"'2_2'!O9","v":1},{"$f":"'2_2'!P9","v":0},{"$f":"'2_2'!Q9","v":0},{"$f":"'2_2'!R9","v":0},{"$f":"'2_2'!S9","v":0},{"$f":"'2_2'!T9","v":0},{"$f":"'2_2'!U9","v":0},null,{"$f":"'2_2'!E141","v":0},{"$f":"'2_2'!F141","v":0},{"$f":"'2_2'!G141","v":0},{"$f":"'2_2'!H141","v":0},{"$f":"'2_2'!I141","v":0},{"$f":"'2_2'!J141","v":0},{"$f":"SUM(X20:AC20)","v":0}]
[3,{"$f":"IF(Configuration!G17=Configuration!F17,99,0)","v":99},null,{"$f":"IF(ISBLANK(Configuration!G17),\"\",Configuration!G17)","v":3},{"$f":"IF(ISBLANK(Configuration!H17),\"\",Configuration!H17)","v":3},{"$f":"IF(ISBLANK(Configuration!I17),\"\",Configuration!I17)","v":3},{"$f":"'3_3'!F9","v":0},{"$f":"'3_3'!G9","v":0},{"$f":"'3_3'!H9","v":0},{"$f":"'3_3'!I9","v":0},{"$f":"'3_3'!J9","v":0},{"$f":"'3_3'!K9","v":0},{"$f":"'3_3'!L9","v":0},{"$f":"'3_3'!M9","v":0},{"$f":"'3_3'!N9","v":0},{"$f":"'3_3'!O9","v":1},{"$f":"'3_3'!P9","v":0},{"$f":"'3_3'!Q9","v":0},{"$f":"'3_3'!R9","v":0},{"$f":"'3_3'!S9","v":0},{"$f":"'3_3'!T9","v":0},{"$f":"'3_3'!U9","v":0},null,{"$f":"'3_3'!E141","v":0},{"$f":"'3_3'!F141","v":0},{"$f":"'3_3'!G141","v":0},{"$f":"'3_3'!H141","v":0},{"$f":"'3_3'!I141","v":0},{"$f":"'3_3'!J141","v":0},{"$f":"SUM(X21:AC21)","v":0}]
[null,{"$f":"IF(Configuration!G18=Configuration!F18,99,0)","v":0},null,{"$f":"IF(ISBLANK(Configuration!G18),\"\",Configuration!G18)","v":""},{"$f":"IF(ISBLANK(Configuration!H18),\"\",Configuration!H18)","v":""},{"$f":"IF(ISBLANK(Configuration!I18),\"\",Configuration!I18)","v":""}]
[null,{"$f":"IF(Configuration!G19=Configuration!F19,99,0)","v":0},null,{"$f":"IF(ISBLANK(Configuration!G19),\"\",Configuration!G19)","v":""},{"$f":"IF(ISBLANK(Configuration!H19),\"\",Configuration!H19)","v":""},{"$f":"IF(ISBLANK(Configuration!I19),\"\",Configuration!I19)","v":""}]
[null,{"$f":"IF(Configuration!G20=Configuration!F20,99,0)","v":0},null,{"$f":"IF(ISBLANK(Configuration!G20),\"\",Configuration!G20)","v":""},{"$f":"IF(ISBLANK(Configuration!H20),\"\",Configuration!H20)","v":""},{"$f":"IF(ISBLANK(Configuration!I20),\"\",Configuration!I20)","v":""}]
[null,{"$f":"IF(Configuration!G21=Configuration!F21,99,0)","v":0},null,{"$f":"IF(ISBLANK(Configuration!G21),\"\",Configuration!G21)","v":""},{"$f":"IF(ISBLANK(Configuration!H21),\"\",Configuration!H21)","v":""},{"$f":"IF(ISBLANK(Configuration!I21),\"\",Configuration!I21)","v":""}]
[null,{"$f":"IF(Configuration!G22=Configuration!F22,99,0)","v":0},null,{"$f":"IF(ISBLANK(Configuration!G22),\"\",Configuration!G22)","v":""},{"$f":"IF(ISBLANK(Configuration!H22),\"\",Configuration!H22)","v":""},{"$f":"IF(ISBLANK(Configuration!I22),\"\",Configuration!I22)","v":""}]
[null,{"$f":"IF(Configuration!G23=Configuration!F23,99,0)","v":0},null,{"$f":"IF(ISBLANK(Configuration!G23),\"\",Configuration!G23)","v":""},{"$f":"IF(ISBLANK(Configuration!H23),\"\",Configuration!H23)","v":""},{"$f":"IF(ISBLANK(Configuration!I23),\"\",Configuration!I23)","v":""}]
[null,{"$f":"IF(Configuration!G24=Configuration!F24,99,0)","v":0},null,{"$f":"IF(ISBLANK(Configuration!G24),\"\",Configuration!G24)","v":""},{"$f":"IF(ISBLANK(Configuration!H24),\"\",Configuration!H24)","v":""},{"$f":"IF(ISBLANK(Configuration!I24),\"\",Configuration!I24)","v":""}]
[null,{"$f":"IF(Configuration!G25=Configuration!F25,99,0)","v":0},null,{"$f":"IF(ISBLANK(Configuration!G25),\"\",Configuration!G25)","v":""},{"$f":"IF(ISBLANK(Configuration!H25),\"\",Configuration!H25)","v":""},{"$f":"IF(ISBLANK(Configuration!I25),\"\",Configuration!I25)","v":""}]
[null,{"$f":"IF(Configuration!G26=Configuration!F26,99,0)","v":0},null,{"$f":"IF(ISBLANK(Configuration!G26),\"\",Configuration!G26)","v":""},{"$f":"IF(ISBLANK(Configuration!H26),\"\",Configuration!H26)","v":""},{"$f":"IF(ISBLANK(Configuration!I26),\"\",Configuration!I26)","v":""}]
[null,{"$f":"IF(Configuration!G27=Configuration!F27,99,0)","v":0},null,{"$f":"IF(ISBLANK(Configuration!G27),\"\",Configuration!G27)","v":""},{"$f":"IF(ISBLANK(Configuration!H27),\"\",Configuration!H27)","v":""},{"$f":"IF(ISBLANK(Configuration!I27),\"\",Configuration!I27)","v":""}]
[null,{"$f":"IF(Configuration!G28=Configuration!F28,99,0)","v":0},null,{"$f":"IF(ISBLANK(Configuration!G28),\"\",Configuration!G28)","v":""},{"$f":"IF(ISBLANK(Configuration!H28),\"\",Configuration!H28)","v":""},{"$f":"IF(ISBLANK(Configuration!I28),\"\",Configuration!I28)","v":""}]
[null,{"$f":"IF(Configuration!G29=Configuration!F29,99,0)","v":0},null,{"$f":"IF(ISBLANK(Configuration!G29),\"\",Configuration!G29)","v":""},{"$f":"IF(ISBLANK(Configuration!H29),\"\",Configuration!H29)","v":""},{"$f":"IF(ISBLANK(Configuration!I29),\"\",Configuration!I29)","v":""}]
[null,{"$f":"IF(Configuration!G30=Configuration!F30,99,0)","v":0},null,{"$f":"IF(ISBLANK(Configuration!G30),\"\",Configuration!G30)","v":""},{"$f":"IF(ISBLANK(Configuration!H30),\"\",Configuration!H30)","v":""},{"$f":"IF(ISBLANK(Configuration!I30),\"\",Configuration!I30)","v":""}]
[null,{"$f":"IF(Configuration!G31=Configuration!F31,99,0)","v":0},null,{"$f":"IF(ISBLANK(Configuration!G31),\"\",Configuration!G31)","v":""},{"$f":"IF(ISBLANK(Configuration!H31),\"\",Configuration!H31)","v":""},{"$f":"IF(ISBLANK(Configuration!I31),\"\",Configuration!I31)","v":""}]
[null,{"$f":"IF(Configuration!G32=Configuration!F32,99,0)","v":0},null,{"$f":"IF(ISBLANK(Configuration!G32),\"\",Configuration!G32)","v":""},{"$f":"IF(ISBLANK(Configuration!H32),\"\",Configuration!H32)","v":""},{"$f":"IF(ISBLANK(Configuration!I32),\"\",Configuration!I32)","v":""}]
[null,{"$f":"IF(Configuration!G33=Configuration!F33,99,0)","v":0},null,{"$f":"IF(ISBLANK(Configuration!G33),\"\",Configuration!G33)","v":""},{"$f":"IF(ISBLANK(Configuration!H33),\"\",Configuration!H33)","v":""},{"$f":"IF(ISBLANK(Configuration!I33),\"\",Configuration!I33)","v":""}]
[null,{"$f":"IF(Configuration!G34=Configuration!F34,99,0)","v":0},null,{"$f":"IF(ISBLANK(Configuration!G34),\"\",Configuration!G34)","v":""},{"$f":"IF(ISBLANK(Configuration!H34),\"\",Configuration!H34)","v":""},{"$f":"IF(ISBLANK(Configuration!I34),\"\",Configuration!I34)","v":""}]
[null,{"$f":"IF(Configuration!G35=Configuration!F35,99,0)","v":0},null,{"$f":"IF(ISBLANK(Configuration!G35),\"\",Configuration!G35)","v":""},{"$f":"IF(ISBLANK(Configuration!H35),\"\",Configuration!H35)","v":""},{"$f":"IF(ISBLANK(Configuration!I35),\"\",Configuration!I35)","v":""}]
[null,{"$f":"IF(Configuration!G36=Configuration!F36,99,0)","v":0},null,{"$f":"IF(ISBLANK(Configuration!G36),\"\",Configuration!G36)","v":""},{"$f":"IF(ISBLANK(Configuration!H36),\"\",Configuration!H36)","v":""},{"$f":"IF(ISBLANK(Configuration!I36),\"\",Configuration!I36)","v":""}]
[null,{"$f":"IF(Configuration!G37=Configuration!F37,99,0)","v":0},null,{"$f":"IF(ISBLANK(Configuration!G37),\"\",Configuration!G37)","v":""},{"$f":"IF(ISBLANK(Configuration!H37),\"\",Configuration!H37)","v":""},{"$f":"IF(ISBLANK(Configuration!I37),\"\",Configuration!I37)","v":""}]
[null,{"$f":"IF(Configuration!G38=Configuration!F38,99,0)","v":0},null,{"$f":"IF(ISBLANK(Configuration!G38),\"\",Configuration!G38)","v":""},{"$f":"IF(ISBLANK(Configuration!H38),\"\",Configuration!H38)","v":""},{"$f":"IF(ISBLANK(Configuration!I38),\"\",Configuration!I38)","v":""}]
[null,{"$f":"IF(Configuration!G39=Configuration!F39,99,0)","v":0},null,{"$f":"IF(ISBLANK(Configuration!G39),\"\",Configuration!G39)","v":""},{"$f":"IF(ISBLANK(Configuration!H39),\"\",Configuration!H39)","v":""},{"$f":"IF(ISBLANK(Configuration!I39),\"\",Configuration!I39)","v":""}]
[null,{"$f":"IF(Configuration!G40=Configuration!F40,99,0)","v":0},null,{"$f":"IF(ISBLANK(Configuration!G40),\"\",Configuration!G40)","v":""},{"$f":"IF(ISBLANK(Configuration!H40),\"\",Configuration!H40)","v":""},{"$f":"IF(ISBLANK(Configuration!I40),\"\",Configuration!I40)","v":""}]
[null,{"$f":"IF(Configuration!G41=Configuration!F41,99,0)","v":0},null,{"$f":"IF(ISBLANK(Configuration!G41),\"\",Configuration!G41)","v":""},{"$f":"IF(ISBLANK(Configuration!H41),\"\",Configuration!H41)","v":""},{"$f":"IF(ISBLANK(Configuration!I41),\"\",Configuration!I41)","v":""}]
[null,{"$f":"IF(Configuration!G42=Configuration!F42,99,0)","v":0},null,{"$f":"IF(ISBLANK(Configuration!G42),\"\",Configuration!G42)","v":""},{"$f":"IF(ISBLANK(Configuration!H42),\"\",Configuration!H42)","v":""},{"$f":"IF(ISBLANK(Configuration!I42),\"\",Configuration!I42)","v":""}]
[null,{"$f":"IF(Configuration!G43=Configuration!F43,99,0)","v":0},null,{"$f":"IF(ISBLANK(Configuration!G43),\"\",Configuration!G43)","v":""},{"$f":"IF(ISBLANK(Configuration!H43),\"\",Configuration!H43)","v":""},{"$f":"IF(ISBLANK(Configuration!I43),\"\",Configuration!I43)","v":""}]
[null,{"$f":"IF(Configuration!G44=Configuration!F44,99,0)","v":0},null,{"$f":"IF(ISBLANK(Configuration!G44),\"\",Configuration!G44)","v":""},{"$f":"IF(ISBLANK(Configuration!H44),\"\",Configuration!H44)","v":""},{"$f":"IF(ISBLANK(Configuration!I44),\"\",Configuration!I44)","v":""}]
[null,{"$f":"IF(Configuration!G45=Configuration!F45,99,0)","v":0},null,{"$f":"IF(ISBLANK(Configuration!G45),\"\",Configuration!G45)","v":""},{"$f":"IF(ISBLANK(Configuration!H45),\"\",Configuration!H45)","v":""},{"$f":"IF(ISBLANK(Configuration!I45),\"\",Configuration!I45)","v":""}]
[null,{"$f":"IF(Configuration!G46=Configuration!F46,99,0)","v":0},null,{"$f":"IF(ISBLANK(Configuration!G46),\"\",Configuration!G46)","v":""},{"$f":"IF(ISBLANK(Configuration!H46),\"\",Configuration!H46)","v":""},{"$f":"IF(ISBLANK(Configuration!I46),\"\",Configuration!I46)","v":""}]
[null,{"$f":"IF(Configuration!G47=Configuration!F47,99,0)","v":0},null,{"$f":"IF(ISBLANK(Configuration!G47),\"\",Configuration!G47)","v":""},{"$f":"IF(ISBLANK(Configuration!H47),\"\",Configuration!H47)","v":""},{"$f":"IF(ISBLANK(Configuration!I47),\"\",Configuration!I47)","v":""}]
[null,{"$f":"IF(Configuration!G48=Configuration!F48,99,0)","v":0},null,{"$f":"IF(ISBLANK(Configuration!G48),\"\",Configuration!G48)","v":""},{"$f":"IF(ISBLANK(Configuration!H48),\"\",Configuration!H48)","v":""},{"$f":"IF(ISBLANK(Configuration!I48),\"\",Configuration!I48)","v":""}]
[null,{"$f":"IF(Configuration!G49=Configuration!F49,99,0)","v":0},null,{"$f":"IF(ISBLANK(Configuration!G49),\"\",Configuration!G49)","v":""},{"$f":"IF(ISBLANK(Configuration!H49),\"\",Configuration!H49)","v":""},{"$f":"IF(ISBLANK(Configuration!I49),\"\",Configuration!I49)","v":""}]
[null,{"$f":"IF(Configuration!G50=Configuration!F50,99,0)","v":0},null,{"$f":"IF(ISBLANK(Configuration!G50),\"\",Configuration!G50)","v":""},{"$f":"IF(ISBLANK(Configuration!H50),\"\",Configuration!H50)","v":""},{"$f":"IF(ISBLANK(Configuration!I50),\"\",Configuration!I50)","v":""}]
[null,{"$f":"IF(Configuration!G51=Configuration!F51,99,0)","v":0},null,{"$f":"IF(ISBLANK(Configuration!G51),\"\",Configuration!G51)","v":""},{"$f":"IF(ISBLANK(Configuration!H51),\"\",Configuration!H51)","v":""},{"$f":"IF(ISBLANK(Configuration!I51),\"\",Configuration!I51)","v":""}]
[null,{"$f":"IF(Configuration!G52=Configuration!F52,99,0)","v":0},null,{"$f":"IF(ISBLANK(Configuration!G52),\"\",Configuration!G52)","v":""},{"$f":"IF(ISBLANK(Configuration!H52),\"\",Configuration!H52)","v":""},{"$f":"IF(ISBLANK(Configuration!I52),\"\",Configuration!I52)","v":""}]
[null,{"$f":"IF(Configuration!G53=Configuration!F53,99,0)","v":0},null,{"$f":"IF(ISBLANK(Configuration!G53),\"\",Configuration!G53)","v":""},{"$f":"IF(ISBLANK(Configuration!H53),\"\",Configuration!H53)","v":""},{"$f":"IF(ISBLANK(Configuration!I53),\"\",Configuration!I53)","v":""}]
[null,{"$f":"IF(Configuration!G54=Configuration!F54,99,0)","v":0},null,{"$f":"IF(ISBLANK(Configuration!G54),\"\",Configuration!G54)","v":""},{"$f":"IF(ISBLANK(Configuration!H54),\"\",Configuration!H54)","v":""},{"$f":"IF(ISBLANK(Configuration!I54),\"\",Configuration!I54)","v":""}]
[null,{"$f":"IF(Configuration!G55=Configuration!F55,99,0)","v":0},null,{"$f":"IF(ISBLANK(Configuration!G55),\"\",Configuration!G55)","v":""},{"$f":"IF(ISBLANK(Configuration!H55),\"\",Configuration!H55)","v":""},{"$f":"IF(ISBLANK(Configuration!I55),\"\",Configuration!I55)","v":""}]
[null,{"$f":"IF(Configuration!G56=Configuration!F56,99,0)","v":0},null,{"$f":"IF(ISBLANK(Configuration!G56),\"\",Configuration!G56)","v":""},{"$f":"IF(ISBLANK(Configuration!H56),\"\",Configuration!H56)","v":""},{"$f":"IF(ISBLANK(Configuration!I56),\"\",Configuration!I56)","v":""}]
[null,{"$f":"IF(Configuration!G57=Configuration!F57,99,0)","v":0},null,{"$f":"IF(ISBLANK(Configuration!G57),\"\",Configuration!G57)","v":""},{"$f":"IF(ISBLANK(Configuration!H57),\"\",Configuration!H57)","v":""},{"$f":"IF(ISBLANK(Configuration!I57),\"\",Configuration!I57)","v":""}]
[null,{"$f":"IF(Configuration!G58=Configuration!F58,99,0)","v":0},null,{"$f":"IF(ISBLANK(Configuration!G58),\"\",Configuration!G58)","v":""},{"$f":"IF(ISBLANK(Configuration!H58),\"\",Configuration!H58)","v":""},{"$f":"IF(ISBLANK(Configuration!I58),\"\",Configuration!I58)","v":""}]
[null,{"$f":"IF(Configuration!G59=Configuration!F59,99,0)","v":0},null,{"$f":"IF(ISBLANK(Configuration!G59),\"\",Configuration!G59)","v":""},{"$f":"IF(ISBLANK(Configuration!H59),\"\",Configuration!H59)","v":""},{"$f":"IF(ISBLANK(Configuration!I59),\"\",Configuration!I59)","v":""}]
[null,{"$f":"IF(Configuration!G60=Configuration!F60,99,0)","v":0},null,{"$f":"IF(ISBLANK(Configuration!G60),\"\",Configuration!G60)","v":""},{"$f":"IF(ISBLANK(Configuration!H60),\"\",Configuration!H60)","v":""},{"$f":"IF(ISBLANK(Configuration!I60),\"\",Configuration!I60)","v":""}]
[null,{"$f":"IF(Configuration!G61=Configuration!F61,99,0)","v":0},null,{"$f":"IF(ISBLANK(Configuration!G61),\"\",Configuration!G61)","v":""},{"$f":"IF(ISBLANK(Configuration!H61),\"\",Configuration!H61)","v":""},{"$f":"IF(ISBLANK(Configuration!I61),\"\",Configuration!I61)","v":""}]
[null,{"$f":"IF(Configuration!G62=Configuration!F62,99,0)","v":0},null,{"$f":"IF(ISBLANK(Configuration!G62),\"\",Configuration!G62)","v":""},{"$f":"IF(ISBLANK(Configuration!H62),\"\",Configuration!H62)","v":""},{"$f":"IF(ISBLANK(Configuration!I62),\"\",Configuration!I62)","v":""}]
[null,{"$f":"IF(Configuration!G63=Configuration!F63,99,0)","v":0},null,{"$f":"IF(ISBLANK(Configuration!G63),\"\",Configuration!G63)","v":""},{"$f":"IF(ISBLANK(Configuration!H63),\"\",Configuration!H63)","v":""},{"$f":"IF(ISBLANK(Configuration!I63),\"\",Configuration!I63)","v":""}]
[null,{"$f":"IF(Configuration!G64=Configuration!F64,99,0)","v":0},null,{"$f":"IF(ISBLANK(Configuration!G64),\"\",Configuration!G64)","v":""},{"$f":"IF(ISBLANK(Configuration!H64),\"\",Configuration!H64)","v":""},{"$f":"IF(ISBLANK(Configuration!I64),\"\",Configuration!I64)","v":""}]
[null,{"$f":"IF(Configuration!G65=Configuration!F65,99,0)","v":0},null,{"$f":"IF(ISBLANK(Configuration!G65),\"\",Configuration!G65)","v":""},{"$f":"IF(ISBLANK(Configuration!H65),\"\",Configuration!H65)","v":""},{"$f":"IF(ISBLANK(Configuration!I65),\"\",Configuration!I65)","v":""}]
[null,{"$f":"IF(Configuration!G66=Configuration!F66,99,0)","v":0},null,{"$f":"IF(ISBLANK(Configuration!G66),\"\",Configuration!G66)","v":""},{"$f":"IF(ISBLANK(Configuration!H66),\"\",Configuration!H66)","v":""},{"$f":"IF(ISBLANK(Configuration!I66),\"\",Configuration!I66)","v":""}]
[null,{"$f":"IF(Configuration!G67=Configuration!F67,99,0)","v":0},null,{"$f":"IF(ISBLANK(Configuration!G67),\"\",Configuration!G67)","v":""},{"$f":"IF(ISBLANK(Configuration!H67),\"\",Configuration!H67)","v":""},{"$f":"IF(ISBLANK(Configuration!I67),\"\",Configuration!I67)","v":""}]
[null,{"$f":"IF(Configuration!G68=Configuration!F68,99,0)","v":0},null,{"$f":"IF(ISBLANK(Configuration!G68),\"\",Configuration!G68)","v":""},{"$f":"IF(ISBLANK(Configuration!H68),\"\",Configuration!H68)","v":""},{"$f":"IF(ISBLANK(Configuration!I68),\"\",Configuration!I68)","v":""}]
[null,{"$f":"IF(Configuration!G69=Configuration!F69,99,0)","v":0},null,{"$f":"IF(ISBLANK(Configuration!G69),\"\",Configuration!G69)","v":""},{"$f":"IF(ISBLANK(Configuration!H69),\"\",Configuration!H69)","v":""},{"$f":"IF(ISBLANK(Configuration!I69),\"\",Configuration!I69)","v":""}]
[null,{"$f":"IF(Configuration!G70=Configuration!F70,99,0)","v":0},null,{"$f":"IF(ISBLANK(Configuration!G70),\"\",Configuration!G70)","v":""},{"$f":"IF(ISBLANK(Configuration!H70),\"\",Configuration!H70)","v":""},{"$f":"IF(ISBLANK(Configuration!I70),\"\",Configuration!I70)","v":""}]
[null,{"$f":"IF(Configuration!G71=Configuration!F71,99,0)","v":0},null,{"$f":"IF(ISBLANK(Configuration!G71),\"\",Configuration!G71)","v":""},{"$f":"IF(ISBLANK(Configuration!H71),\"\",Configuration!H71)","v":""},{"$f":"IF(ISBLANK(Configuration!I71),\"\",Configuration!I71)","v":""}]
[null,{"$f":"IF(Configuration!G72=Configuration!F72,99,0)","v":0},null,{"$f":"IF(ISBLANK(Configuration!G72),\"\",Configuration!G72)","v":""},{"$f":"IF(ISBLANK(Configuration!H72),\"\",Configuration!H72)","v":""},{"$f":"IF(ISBLANK(Configuration!I72),\"\",Configuration!I72)","v":""}]
[null,{"$f":"IF(Configuration!G73=Configuration!F73,99,0)","v":0},null,{"$f":"IF(ISBLANK(Configuration!G73),\"\",Configuration!G73)","v":""},{"$f":"IF(ISBLANK(Configuration!H73),\"\",Configuration!H73)","v":""},{"$f":"IF(ISBLANK(Configuration!I73),\"\",Configuration!I73)","v":""}]
[null,{"$f":"IF(Configuration!G74=Configuration!F74,99,0)","v":0},null,{"$f":"IF(ISBLANK(Configuration!G74),\"\",Configuration!G74)","v":""},{"$f":"IF(ISBLANK(Configuration!H74),\"\",Configuration!H74)","v":""},{"$f":"IF(ISBLANK(Configuration!I74),\"\",Configuration!I74)","v":""}]
[null,{"$f":"IF(Configuration!G75=Configuration!F75,99,0)","v":0},null,{"$f":"IF(ISBLANK(Configuration!G75),\"\",Configuration!G75)","v":""},{"$f":"IF(ISBLANK(Configuration!H75),\"\",Configuration!H75)","v":""},{"$f":"IF(ISBLANK(Configuration!I75),\"\",Configuration!I75)","v":""}]
[null,{"$f":"IF(Configuration!G76=Configuration!F76,99,0)","v":0},null,{"$f":"IF(ISBLANK(Configuration!G76),\"\",Configuration!G76)","v":""},{"$f":"IF(ISBLANK(Configuration!H76),\"\",Configuration!H76)","v":""},{"$f":"IF(ISBLANK(Configuration!I76),\"\",Configuration!I76)","v":""}]
[null,{"$f":"IF(Configuration!G77=Configuration!F77,99,0)","v":0},null,{"$f":"IF(ISBLANK(Configuration!G77),\"\",Configuration!G77)","v":""},{"$f":"IF(ISBLANK(Configuration!H77),\"\",Configuration!H77)","v":""},{"$f":"IF(ISBLANK(Configuration!I77),\"\",Configuration!I77)","v":""}]
[null,{"$f":"IF(Configuration!G78=Configuration!F78,99,0)","v":0},null,{"$f":"IF(ISBLANK(Configuration!G78),\"\",Configuration!G78)","v":""},{"$f":"IF(ISBLANK(Configuration!H78),\"\",Configuration!H78)","v":""},{"$f":"IF(ISBLANK(Configuration!I78),\"\",Configuration!I78)","v":""}]
[null,{"$f":"IF(Configuration!G79=Configuration!F79,99,0)","v":0},null,{"$f":"IF(ISBLANK(Configuration!G79),\"\",Configuration!G79)","v":""},{"$f":"IF(ISBLANK(Configuration!H79),\"\",Configuration!H79)","v":""},{"$f":"IF(ISBLANK(Configuration!I79),\"\",Configuration!I79)","v":""}]
[null,{"$f":"IF(Configuration!G80=Configuration!F80,99,0)","v":0},null,{"$f":"IF(ISBLANK(Configuration!G80),\"\",Configuration!G80)","v":""},{"$f":"IF(ISBLANK(Configuration!H80),\"\",Configuration!H80)","v":""},{"$f":"IF(ISBLANK(Configuration!I80),\"\",Configuration!I80)","v":""}]
[null,{"$f":"IF(Configuration!G81=Configuration!F81,99,0)","v":0},null,{"$f":"IF(ISBLANK(Configuration!G81),\"\",Configuration!G81)","v":""},{"$f":"IF(ISBLANK(Configuration!H81),\"\",Configuration!H81)","v":""},{"$f":"IF(ISBLANK(Configuration!I81),\"\",Configuration!I81)","v":""}]
[null,{"$f":"IF(Configuration!G82=Configuration!F82,99,0)","v":0},null,{"$f":"IF(ISBLANK(Configuration!G82),\"\",Configuration!G82)","v":""},{"$f":"IF(ISBLANK(Configuration!H82),\"\",Configuration!H82)","v":""},{"$f":"IF(ISBLANK(Configuration!I82),\"\",Configuration!I82)","v":""}]
[null,{"$f":"IF(Configuration!G83=Configuration!F83,99,0)","v":0},null,{"$f":"IF(ISBLANK(Configuration!G83),\"\",Configuration!G83)","v":""},{"$f":"IF(ISBLANK(Configuration!H83),\"\",Configuration!H83)","v":""},{"$f":"IF(ISBLANK(Configuration!I83),\"\",Configuration!I83)","v":""}]
[null,{"$f":"IF(Configuration!G84=Configuration!F84,99,0)","v":0},null,{"$f":"IF(ISBLANK(Configuration!G84),\"\",Configuration!G84)","v":""},{"$f":"IF(ISBLANK(Configuration!H84),\"\",Configuration!H84)","v":""},{"$f":"IF(ISBLANK(Configuration!I84),\"\",Configuration!I84)","v":""}]
[null,{"$f":"IF(Configuration!G85=Configuration!F85,99,0)","v":0},null,{"$f":"IF(ISBLANK(Configuration!G85),\"\",Configuration!G85)","v":""},{"$f":"IF(ISBLANK(Configuration!H85),\"\",Configuration!H85)","v":""},{"$f":"IF(ISBLANK(Configuration!I85),\"\",Configuration!I85)","v":""}]
[null,{"$f":"IF(Configuration!G86=Configuration!F86,99,0)","v":0},null,{"$f":"IF(ISBLANK(Configuration!G86),\"\",Configuration!G86)","v":""},{"$f":"IF(ISBLANK(Configuration!H86),\"\",Configuration!H86)","v":""},{"$f":"IF(ISBLANK(Configuration!I86),\"\",Configuration!I86)","v":""}]
[null,{"$f":"IF(Configuration!G87=Configuration!F87,99,0)","v":0},null,{"$f":"IF(ISBLANK(Configuration!G87),\"\",Configuration!G87)","v":""},{"$f":"IF(ISBLANK(Configuration!H87),\"\",Configuration!H87)","v":""},{"$f":"IF(ISBLANK(Configuration!I87),\"\",Configuration!I87)","v":""}]
[null,{"$f":"IF(Configuration!G88=Configuration!F88,99,0)","v":0},null,{"$f":"IF(ISBLANK(Configuration!G88),\"\",Configuration!G88)","v":""},{"$f":"IF(ISBLANK(Configuration!H88),\"\",Configuration!H88)","v":""},{"$f":"IF(ISBLANK(Configuration!I88),\"\",Configuration!I88)","v":""}]
[null,{"$f":"IF(Configuration!G89=Configuration!F89,99,0)","v":0},null,{"$f":"IF(ISBLANK(Configuration!G89),\"\",Configuration!G89)","v":""},{"$f":"IF(ISBLANK(Configuration!H89),\"\",Configuration!H89)","v":""},{"$f":"IF(ISBLANK(Configuration!I89),\"\",Configuration!I89)","v":""}]
[null,{"$f":"IF(Configuration!G90=Configuration!F90,99,0)","v":0},null,{"$f":"IF(ISBLANK(Configuration!G90),\"\",Configuration!G90)","v":""},{"$f":"IF(ISBLANK(Configuration!H90),\"\",Configuration!H90)","v":""},{"$f":"IF(ISBLANK(Configuration!I90),\"\",Configuration!I90)","v":""}]
[null,{"$f":"IF(Configuration!G91=Configuration!F91,99,0)","v":0},null,{"$f":"IF(ISBLANK(Configuration!G91),\"\",Configuration!G91)","v":""},{"$f":"IF(ISBLANK(Configuration!H91),\"\",Configuration!H91)","v":""},{"$f":"IF(ISBLANK(Configuration!I91),\"\",Configuration!I91)","v":""}]
[null,{"$f":"IF(Configuration!G92=Configuration!F92,99,0)","v":0},null,{"$f":"IF(ISBLANK(Configuration!G92),\"\",Configuration!G92)","v":""},{"$f":"IF(ISBLANK(Configuration!H92),\"\",Configuration!H92)","v":""},{"$f":"IF(ISBLANK(Configuration!I92),\"\",Configuration!I92)","v":""}]
[null,{"$f":"IF(Configuration!G93=Configuration!F93,99,0)","v":0},null,{"$f":"IF(ISBLANK(Configuration!G93),\"\",Configuration!G93)","v":""},{"$f":"IF(ISBLANK(Configuration!H93),\"\",Configuration!H93)","v":""},{"$f":"IF(ISBLANK(Configuration!I93),\"\",Configuration!I93)","v":""}]
[null,{"$f":"IF(Configuration!G94=Configuration!F94,99,0)","v":0},null,{"$f":"IF(ISBLANK(Configuration!G94),\"\",Configuration!G94)","v":""},{"$f":"IF(ISBLANK(Configuration!H94),\"\",Configuration!H94)","v":""},{"$f":"IF(ISBLANK(Configuration!I94),\"\",Configuration!I94)","v":""}]
[null,{"$f":"IF(Configuration!G95=Configuration!F95,99,0)","v":0},null,{"$f":"IF(ISBLANK(Configuration!G95),\"\",Configuration!G95)","v":""},{"$f":"IF(ISBLANK(Configuration!H95),\"\",Configuration!H95)","v":""},{"$f":"IF(ISBLANK(Configuration!I95),\"\",Configuration!I95)","v":""}]
[null,{"$f":"IF(Configuration!G96=Configuration!F96,99,0)","v":0},null,{"$f":"IF(ISBLANK(Configuration!G96),\"\",Configuration!G96)","v":""},{"$f":"IF(ISBLANK(Configuration!H96),\"\",Configuration!H96)","v":""},{"$f":"IF(ISBLANK(Configuration!I96),\"\",Configuration!I96)","v":""}]
[null,{"$f":"IF(Configuration!G97=Configuration!F97,99,0)","v":0},null,{"$f":"IF(ISBLANK(Configuration!G97),\"\",Configuration!G97)","v":""},{"$f":"IF(ISBLANK(Configuration!H97),\"\",Configuration!H97)","v":""},{"$f":"IF(ISBLANK(Configuration!I97),\"\",Configuration!I97)","v":""}]
[null,{"$f":"IF(Configuration!G98=Configuration!F98,99,0)","v":0},null,{"$f":"IF(ISBLANK(Configuration!G98),\"\",Configuration!G98)","v":""},{"$f":"IF(ISBLANK(Configuration!H98),\"\",Configuration!H98)","v":""},{"$f":"IF(ISBLANK(Configuration!I98),\"\",Configuration!I98)","v":""}]
[null,{"$f":"IF(Configuration!G99=Configuration!F99,99,0)","v":0},null,{"$f":"IF(ISBLANK(Configuration!G99),\"\",Configuration!G99)","v":""},{"$f":"IF(ISBLANK(Configuration!H99),\"\",Configuration!H99)","v":""},{"$f":"IF(ISBLANK(Configuration!I99),\"\",Configuration!I99)","v":""}]
[null,{"$f":"IF(Configuration!G100=Configuration!F100,99,0)","v":0},null,{"$f":"IF(ISBLANK(Configuration!G100),\"\",Configuration!G100)","v":""},{"$f":"IF(ISBLANK(Configuration!H100),\"\",Configuration!H100)","v":""},{"$f":"IF(ISBLANK(Configuration!I100),\"\",Configuration!I100)","v":""}]
[null,{"$f":"IF(Configuration!G101=Configuration!F101,99,0)","v":0},null,{"$f":"IF(ISBLANK(Configuration!G101),\"\",Configuration!G101)","v":""},{"$f":"IF(ISBLANK(Configuration!H101),\"\",Configuration!H101)","v":""},{"$f":"IF(ISBLANK(Configuration!I101),\"\",Configuration!I101)","v":""}]
[null,{"$f":"IF(Configuration!G102=Configuration!F102,99,0)","v":0},null,{"$f":"IF(ISBLANK(Configuration!G102),\"\",Configuration!G102)","v":""},{"$f":"IF(ISBLANK(Configuration!H102),\"\",Configuration!H102)","v":""},{"$f":"IF(ISBLANK(Configuration!I102),\"\",Configuration!I102)","v":""}]
[null,{"$f":"IF(Configuration!G103=Configuration!F103,99,0)","v":0},null,{"$f":"IF(ISBLANK(Configuration!G103),\"\",Configuration!G103)","v":""},{"$f":"IF(ISBLANK(Configuration!H103),\"\",Configuration!H103)","v":""},{"$f":"IF(ISBLANK(Configuration!I103),\"\",Configuration!I103)","v":""}]
[null,{"$f":"IF(Configuration!G104=Configuration!F104,99,0)","v":0},null,{"$f":"IF(ISBLANK(Configuration!G104),\"\",Configuration!G104)","v":""},{"$f":"IF(ISBLANK(Configuration!H104),\"\",Configuration!H104)","v":""},{"$f":"IF(ISBLANK(Configuration!I104),\"\",Configuration!I104)","v":""}]
[null,{"$f":"IF(Configuration!G105=Configuration!F105,99,0)","v":0},null,{"$f":"IF(ISBLANK(Configuration!G105),\"\",Configuration!G105)","v":""},{"$f":"IF(ISBLANK(Configuration!H105),\"\",Configuration!H105)","v":""},{"$f":"IF(ISBLANK(Configuration!I105),\"\",Configuration!I105)","v":""}]
[null,{"$f":"IF(Configuration!G106=Configuration!F106,99,0)","v":0},null,{"$f":"IF(ISBLANK(Configuration!G106),\"\",Configuration!G106)","v":""},{"$f":"IF(ISBLANK(Configuration!H106),\"\",Configuration!H106)","v":""},{"$f":"IF(ISBLANK(Configuration!I106),\"\",Configuration!I106)","v":""}]
[null,{"$f":"IF(Configuration!G107=Configuration!F107,99,0)","v":0},null,{"$f":"IF(ISBLANK(Configuration!G107),\"\",Configuration!G107)","v":""},{"$f":"IF(ISBLANK(Configuration!H107),\"\",Configuration!H107)","v":""},{"$f":"IF(ISBLANK(Configuration!I107),\"\",Configuration!I107)","v":""}]
[null,{"$f":"IF(Configuration!G108=Configuration!F108,99,0)","v":0},null,{"$f":"IF(ISBLANK(Configuration!G108),\"\",Configuration!G108)","v":""},{"$f":"IF(ISBLANK(Configuration!H108),\"\",Configuration!H108)","v":""},{"$f":"IF(ISBLANK(Configuration!I108),\"\",Configuration!I108)","v":""}]
[null,{"$f":"IF(Configuration!G109=Configuration!F109,99,0)","v":0},null,{"$f":"IF(ISBLANK(Configuration!G109),\"\",Configuration!G109)","v":""},{"$f":"IF(ISBLANK(Configuration!H109),\"\",Configuration!H109)","v":""},{"$f":"IF(ISBLANK(Configuration!I109),\"\",Configuration!I109)","v":""}]
[null,{"$f":"IF(Configuration!G110=Configuration!F110,99,0)","v":0},null,{"$f":"IF(ISBLANK(Configuration!G110),\"\",Configuration!G110)","v":""},{"$f":"IF(ISBLANK(Configuration!H110),\"\",Configuration!H110)","v":""},{"$f":"IF(ISBLANK(Configuration!I110),\"\",Configuration!I110)","v":""}]
[null,{"$f":"IF(Configuration!G111=Configuration!F111,99,0)","v":0},null,{"$f":"IF(ISBLANK(Configuration!G111),\"\",Configuration!G111)","v":""},{"$f":"IF(ISBLANK(Configuration!H111),\"\",Configuration!H111)","v":""},{"$f":"IF(ISBLANK(Configuration!I111),\"\",Configuration!I111)","v":""}]
[null,{"$f":"IF(Configuration!G112=Configuration!F112,99,0)","v":0},null,{"$f":"IF(ISBLANK(Configuration!G112),\"\",Configuration!G112)","v":""},{"$f":"IF(ISBLANK(Configuration!H112),\"\",Configuration!H112)","v":""},{"$f":"IF(ISBLANK(Configuration!I112),\"\",Configuration!I112)","v":""}]
[null,{"$f":"IF(Configuration!G113=Configuration!F113,99,0)","v":0},null,{"$f":"IF(ISBLANK(Configuration!G113),\"\",Configuration!G113)","v":""},{"$f":"IF(ISBLANK(Configuration!H113),\"\",Configuration!H113)","v":""},{"$f":"IF(ISBLANK(Configuration!I113),\"\",Configuration!I113)","v":""}]
[null,null,null,"Total",null,null,{"$f":"SUM(G19:G98)","v":800},{"$f":"SUM(H19:H98)","v":0},{"$f":"SUM(I19:I98)","v":90000},{"$f":"SUM(J19:J98)","v":0},{"$f":"SUM(K19:K98)","v":0},{"$f":"SUM(L19:L98)","v":0},0,{"$f":"SUM(N19:N98)","v":22700},{"$f":"SUM(O19:O98)","v":113500},null,{"$f":"SUM(Q19:Q98)","v":113500},0,0,0,0,{"$f":"SUM(V19:V98)","v":0},null,{"$f":"SUM(X19:X117)","v":1},{"$f":"SUM(Y19:Y117)","v":2},{"$f":"SUM(Z19:Z117)","v":0},{"$f":"SUM(AA19:AA117)","v":5},{"$f":"SUM(AB19:AB117)","v":0},{"$f":"SUM(AC19:AC117)","v":0},{"$f":"SUM(AD19:AD117)","v":8}]
[]
[]
[]
[]
[]
[]
[]
[]
[]
[]
[]
[]
[]
[]
[]
[]
[]
[]
[]
[]
[]
[]
[]
[]
[]
[]
[]
[]
[]
[]
[]
[]
[]
[]
[]
["test"]
[]
[]
[]
[]
[]
[]
[]
[]
[]
[]
[]
[]
[]
[]
[]
[]
[]
[]
[]
[]
[]
[]
[]
[]
[]
[]
[null,null,null,null,"unique partners"]
[{"$f":"SUM(D182:D280)/99","v":3},null,{"$f":"IFERROR(INDEX($E$19:$E$117, MATCH(0,IF(ISBLANK($E$19:$E$119),1,COUNTIF(A$18:$AS181, $E$19:$E$117)), 0)),\"\")","v":""},{"$f":"IF(E182=$C$182,0,99)","v":99},{"$f":"IFERROR(INDEX($E$19:$E$117, MATCH(0,IF(ISBLANK($E$19:$E$117),1,COUNTIF(E$181:$E181, $E$19:$E$117)), 0)),\"\")","v":"tes1"},{"$f":"SUMIF(E$19:E$117,E182,$Q$19:$Q$118)/1000","v":113.5}]
[null,null,null,99,{"$f":"IFERROR(INDEX($E$19:$E$117, MATCH(0,IF(ISBLANK($E$19:$E$117),1,COUNTIF(E$181:$E182, $E$19:$E$117)), 0)),\"\")","v":2},{"$f":"SUMIF(E$19:E$117,E183,$Q$19:$Q$118)/1000","v":0}]
[null,null,null,99,{"$f":"IFERROR(INDEX($E$19:$E$117, MATCH(0,IF(ISBLANK($E$19:$E$117),1,COUNTIF(E$181:$E183, $E$19:$E$117)), 0)),\"\")","v":3},0]
[null,null,null,0,{"$f":"IFERROR(INDEX($E$19:$E$117, MATCH(0,IF(ISBLANK($E$19:$E$117),1,COUNTIF(E$181:$E184, $E$19:$E$117)), 0)),\"\")","v":""},0]
[null,null,null,0,{"$f":"IFERROR(INDEX($E$19:$E$117, MATCH(0,IF(ISBLANK($E$19:$E$117),1,COUNTIF(E$181:$E185, $E$19:$E$117)), 0)),\"\")","v":""},0]
[null,null,null,0,{"$f":"IFERROR(INDEX($E$19:$E$117, MATCH(0,IF(ISBLANK($E$19:$E$117),1,COUNTIF(E$181:$E186, $E$19:$E$117)), 0)),\"\")","v":""},0]
[null,null,null,0,{"$f":"IFERROR(INDEX($E$19:$E$117, MATCH(0,IF(ISBLANK($E$19:$E$117),1,COUNTIF(E$181:$E187, $E$19:$E$117)), 0)),\"\")","v":""},0]
[null,null,null,0,{"$f":"IFERROR(INDEX($E$19:$E$117, MATCH(0,IF(ISBLANK($E$19:$E$117),1,COUNTIF(E$181:$E188, $E$19:$E$117)), 0)),\"\")","v":""},0]
[null,null,null,0,{"$f":"IFERROR(INDEX($E$19:$E$117, MATCH(0,IF(ISBLANK($E$19:$E$117),1,COUNTIF(E$181:$E189, $E$19:$E$117)), 0)),\"\")","v":""},0]
[null,null,null,0,{"$f":"IFERROR(INDEX($E$19:$E$117, MATCH(0,IF(ISBLANK($E$19:$E$117),1,COUNTIF(E$181:$E190, $E$19:$E$117)), 0)),\"\")","v":""},0]
[null,null,null,0,{"$f":"IFERROR(INDEX($E$19:$E$117, MATCH(0,IF(ISBLANK($E$19:$E$117),1,COUNTIF(E$181:$E191, $E$19:$E$117)), 0)),\"\")","v":""},0]
[null,null,null,0,{"$f":"IFERROR(INDEX($E$19:$E$117, MATCH(0,IF(ISBLANK($E$19:$E$117),1,COUNTIF(E$181:$E192, $E$19:$E$117)), 0)),\"\")","v":""},0]
[null,null,null,0,{"$f":"IFERROR(INDEX($E$19:$E$117, MATCH(0,IF(ISBLANK($E$19:$E$117),1,COUNTIF(E$181:$E193, $E$19:$E$117)), 0)),\"\")","v":""},0]
[null,null,null,0,{"$f":"IFERROR(INDEX($E$19:$E$117, MATCH(0,IF(ISBLANK($E$19:$E$117),1,COUNTIF(E$181:$E194, $E$19:$E$117)), 0)),\"\")","v":""},0]
[null,null,null,0,{"$f":"IFERROR(INDEX($E$19:$E$117, MATCH(0,IF(ISBLANK($E$19:$E$117),1,COUNTIF(E$181:$E195, $E$19:$E$117)), 0)),\"\")","v":""},0]
[null,null,null,0,{"$f":"IFERROR(INDEX($E$19:$E$117, MATCH(0,IF(ISBLANK($E$19:$E$117),1,COUNTIF(E$181:$E196, $E$19:$E$117)), 0)),\"\")","v":""},0]
[null,null,null,0,{"$f":"IFERROR(INDEX($E$19:$E$117, MATCH(0,IF(ISBLANK($E$19:$E$117),1,COUNTIF(E$181:$E197, $E$19:$E$117)), 0)),\"\")","v":""},0]
[null,null,null,0,{"$f":"IFERROR(INDEX($E$19:$E$117, MATCH(0,IF(ISBLANK($E$19:$E$117),1,COUNTIF(E$181:$E198, $E$19:$E$117)), 0)),\"\")","v":""},0]
[null,null,null,0,{"$f":"IFERROR(INDEX($E$19:$E$117, MATCH(0,IF(ISBLANK($E$19:$E$117),1,COUNTIF(E$181:$E199, $E$19:$E$117)), 0)),\"\")","v":""},0]
[null,null,null,0,{"$f":"IFERROR(INDEX($E$19:$E$117, MATCH(0,IF(ISBLANK($E$19:$E$117),1,COUNTIF(E$181:$E200, $E$19:$E$117)), 0)),\"\")","v":""},0]
[null,null,null,0,{"$f":"IFERROR(INDEX($E$19:$E$117, MATCH(0,IF(ISBLANK($E$19:$E$117),1,COUNTIF(E$181:$E201, $E$19:$E$117)), 0)),\"\")","v":""},0]
[null,null,null,0,{"$f":"IFERROR(INDEX($E$19:$E$117, MATCH(0,IF(ISBLANK($E$19:$E$117),1,COUNTIF(E$181:$E202, $E$19:$E$117)), 0)),\"\")","v":""},0]
[null,null,null,0,{"$f":"IFERROR(INDEX($E$19:$E$117, MATCH(0,IF(ISBLANK($E$19:$E$117),1,COUNTIF(E$181:$E203, $E$19:$E$117)), 0)),\"\")","v":""},0]
[null,null,null,0,{"$f":"IFERROR(INDEX($E$19:$E$117, MATCH(0,IF(ISBLANK($E$19:$E$117),1,COUNTIF(E$181:$E204, $E$19:$E$117)), 0)),\"\")","v":""},0]
[null,null,null,0,{"$f":"IFERROR(INDEX($E$19:$E$117, MATCH(0,IF(ISBLANK($E$19:$E$117),1,COUNTIF(E$181:$E205, $E$19:$E$117)), 0)),\"\")","v":""},0]
[null,null,null,0,{"$f":"IFERROR(INDEX($E$19:$E$117, MATCH(0,IF(ISBLANK($E$19:$E$117),1,COUNTIF(E$181:$E206, $E$19:$E$117)), 0)),\"\")","v":""},0]
[null,null,null,0,{"$f":"IFERROR(INDEX($E$19:$E$117, MATCH(0,IF(ISBLANK($E$19:$E$117),1,COUNTIF(E$181:$E207, $E$19:$E$117)), 0)),\"\")","v":""},0]
[null,null,null,0,{"$f":"IFERROR(INDEX($E$19:$E$117, MATCH(0,IF(ISBLANK($E$19:$E$117),1,COUNTIF(E$181:$E208, $E$19:$E$117)), 0)),\"\")","v":""},0]
[null,null,null,0,{"$f":"IFERROR(INDEX($E$19:$E$117, MATCH(0,IF(ISBLANK($E$19:$E$117),1,COUNTIF(E$181:$E209, $E$19:$E$117)), 0)),\"\")","v":""},0]
[null,null,null,0,{"$f":"IFERROR(INDEX($E$19:$E$117, MATCH(0,IF(ISBLANK($E$19:$E$117),1,COUNTIF(E$181:$E210, $E$19:$E$117)), 0)),\"\")","v":""},0]
[null,null,null,0,{"$f":"IFERROR(INDEX($E$19:$E$117, MATCH(0,IF(ISBLANK($E$19:$E$117),1,COUNTIF(E$181:$E211, $E$19:$E$117)), 0)),\"\")","v":""},0]
[null,null,null,0,{"$f":"IFERROR(INDEX($E$19:$E$117, MATCH(0,IF(ISBLANK($E$19:$E$117),1,COUNTIF(E$181:$E212, $E$19:$E$117)), 0)),\"\")","v":""},0]
[null,null,null,0,{"$f":"IFERROR(INDEX($E$19:$E$117, MATCH(0,IF(ISBLANK($E$19:$E$117),1,COUNTIF(E$181:$E213, $E$19:$E$117)), 0)),\"\")","v":""},0]
[null,null,null,0,{"$f":"IFERROR(INDEX($E$19:$E$117, MATCH(0,IF(ISBLANK($E$19:$E$117),1,COUNTIF(E$181:$E214, $E$19:$E$117)), 0)),\"\")","v":""},0]
[null,null,null,0,{"$f":"IFERROR(INDEX($E$19:$E$117, MATCH(0,IF(ISBLANK($E$19:$E$117),1,COUNTIF(E$181:$E215, $E$19:$E$117)), 0)),\"\")","v":""},0]
[null,null,null,0,{"$f":"IFERROR(INDEX($E$19:$E$117, MATCH(0,IF(ISBLANK($E$19:$E$117),1,COUNTIF(E$181:$E216, $E$19:$E$117)), 0)),\"\")","v":""},0]
[null,null,null,0,{"$f":"IFERROR(INDEX($E$19:$E$117, MATCH(0,IF(ISBLANK($E$19:$E$117),1,COUNTIF(E$181:$E217, $E$19:$E$117)), 0)),\"\")","v":""},0]
[null,null,null,0,{"$f":"IFERROR(INDEX($E$19:$E$117, MATCH(0,IF(ISBLANK($E$19:$E$117),1,COUNTIF(E$181:$E218, $E$19:$E$117)), 0)),\"\")","v":""},0]
[null,null,null,0,{"$f":"IFERROR(INDEX($E$19:$E$117, MATCH(0,IF(ISBLANK($E$19:$E$117),1,COUNTIF(E$181:$E219, $E$19:$E$117)), 0)),\"\")","v":""},0]
[null,null,null,0,{"$f":"IFERROR(INDEX($E$19:$E$117, MATCH(0,IF(ISBLANK($E$19:$E$117),1,COUNTIF(E$181:$E220, $E$19:$E$117)), 0)),\"\")","v":""},0]
[null,null,null,0,{"$f":"IFERROR(INDEX($E$19:$E$117, MATCH(0,IF(ISBLANK($E$19:$E$117),1,COUNTIF(E$181:$E221, $E$19:$E$117)), 0)),\"\")","v":""},0]
[null,null,null,0,{"$f":"IFERROR(INDEX($E$19:$E$117, MATCH(0,IF(ISBLANK($E$19:$E$117),1,COUNTIF(E$181:$E222, $E$19:$E$117)), 0)),\"\")","v":""},0]
[null,null,null,0,{"$f":"IFERROR(INDEX($E$19:$E$117, MATCH(0,IF(ISBLANK($E$19:$E$117),1,COUNTIF(E$181:$E223, $E$19:$E$117)), 0)),\"\")","v":""},0]
[null,null,null,0,{"$f":"IFERROR(INDEX($E$19:$E$117, MATCH(0,IF(ISBLANK($E$19:$E$117),1,COUNTIF(E$181:$E224, $E$19:$E$117)), 0)),\"\")","v":""},0]
[null,null,null,0,{"$f":"IFERROR(INDEX($E$19:$E$117, MATCH(0,IF(ISBLANK($E$19:$E$117),1,COUNTIF(E$181:$E225, $E$19:$E$117)), 0)),\"\")","v":""},0]
[null,null,null,0,{"$f":"IFERROR(INDEX($E$19:$E$117, MATCH(0,IF(ISBLANK($E$19:$E$117),1,COUNTIF(E$181:$E226, $E$19:$E$117)), 0)),\"\")","v":""},0]
[null,null,null,0,{"$f":"IFERROR(INDEX($E$19:$E$117, MATCH(0,IF(ISBLANK($E$19:$E$117),1,COUNTIF(E$181:$E227, $E$19:$E$117)), 0)),\"\")","v":""},0]
[null,null,null,0,{"$f":"IFERROR(INDEX($E$19:$E$117, MATCH(0,IF(ISBLANK($E$19:$E$117),1,COUNTIF(E$181:$E228, $E$19:$E$117)), 0)),\"\")","v":""},0]
[null,null,null,0,{"$f":"IFERROR(INDEX($E$19:$E$117, MATCH(0,IF(ISBLANK($E$19:$E$117),1,COUNTIF(E$181:$E229, $E$19:$E$117)), 0)),\"\")","v":""},0]
[null,null,null,0,{"$f":"IFERROR(INDEX($E$19:$E$117, MATCH(0,IF(ISBLANK($E$19:$E$117),1,COUNTIF(E$181:$E230, $E$19:$E$117)), 0)),\"\")","v":""},0]
[null,null,null,0,{"$f":"IFERROR(INDEX($E$19:$E$117, MATCH(0,IF(ISBLANK($E$19:$E$117),1,COUNTIF(E$181:$E231, $E$19:$E$117)), 0)),\"\")","v":""},0]
[null,null,null,0,{"$f":"IFERROR(INDEX($E$19:$E$117, MATCH(0,IF(ISBLANK($E$19:$E$117),1,COUNTIF(E$181:$E232, $E$19:$E$117)), 0)),\"\")","v":""},0]
[null,null,null,0,{"$f":"IFERROR(INDEX($E$19:$E$117, MATCH(0,IF(ISBLANK($E$19:$E$117),1,COUNTIF(E$181:$E233, $E$19:$E$117)), 0)),\"\")","v":""},0]
[null,null,null,0,{"$f":"IFERROR(INDEX($E$19:$E$117, MATCH(0,IF(ISBLANK($E$19:$E$117),1,COUNTIF(E$181:$E234, $E$19:$E$117)), 0)),\"\")","v":""},0]
[null,null,null,0,{"$f":"IFERROR(INDEX($E$19:$E$117, MATCH(0,IF(ISBLANK($E$19:$E$117),1,COUNTIF(E$181:$E235, $E$19:$E$117)), 0)),\"\")","v":""},0]
[null,null,null,0,{"$f":"IFERROR(INDEX($E$19:$E$117, MATCH(0,IF(ISBLANK($E$19:$E$117),1,COUNTIF(E$181:$E236, $E$19:$E$117)), 0)),\"\")","v":""},0]
[null,null,null,0,{"$f":"IFERROR(INDEX($E$19:$E$117, MATCH(0,IF(ISBLANK($E$19:$E$117),1,COUNTIF(E$181:$E237, $E$19:$E$117)), 0)),\"\")","v":""},0]
[null,null,null,0,{"$f":"IFERROR(INDEX($E$19:$E$117, MATCH(0,IF(ISBLANK($E$19:$E$117),1,COUNTIF(E$181:$E238, $E$19:$E$117)), 0)),\"\")","v":""},0]
[null,null,null,0,{"$f":"IFERROR(INDEX($E$19:$E$117, MATCH(0,IF(ISBLANK($E$19:$E$117),1,COUNTIF(E$181:$E239, $E$19:$E$117)), 0)),\"\")","v":""},0]
[null,null,null,0,{"$f":"IFERROR(INDEX($E$19:$E$117, MATCH(0,IF(ISBLANK($E$19:$E$117),1,COUNTIF(E$181:$E240, $E$19:$E$117)), 0)),\"\")","v":""},0]
[null,null,null,0,{"$f":"IFERROR(INDEX($E$19:$E$117, MATCH(0,IF(ISBLANK($E$19:$E$117),1,COUNTIF(E$181:$E241, $E$19:$E$117)), 0)),\"\")","v":""},0]
[null,null,null,0,{"$f":"IFERROR(INDEX($E$19:$E$117, MATCH(0,IF(ISBLANK($E$19:$E$117),1,COUNTIF(E$181:$E242, $E$19:$E$117)), 0)),\"\")","v":""},0]
[null,null,null,0,{"$f":"IFERROR(INDEX($E$19:$E$117, MATCH(0,IF(ISBLANK($E$19:$E$117),1,COUNTIF(E$181:$E243, $E$19:$E$117)), 0)),\"\")","v":""},0]
[null,null,null,0,{"$f":"IFERROR(INDEX($E$19:$E$117, MATCH(0,IF(ISBLANK($E$19:$E$117),1,COUNTIF(E$181:$E244, $E$19:$E$117)), 0)),\"\")","v":""},0]
[null,null,null,{"$f":"IF(E246=$C$182,0,99)","v":0},{"$f":"IFERROR(INDEX($E$19:$E$117, MATCH(0,IF(ISBLANK($E$19:$E$117),1,COUNTIF(E$181:$E245, $E$19:$E$117)), 0)),\"\")","v":""},0]
[null,null,null,0,{"$f":"IFERROR(INDEX($E$19:$E$117, MATCH(0,IF(ISBLANK($E$19:$E$117),1,COUNTIF(E$181:$E246, $E$19:$E$117)), 0)),\"\")","v":""},{"$f":"SUMIF(E$19:E$117,E247,$Q$19:$Q$118)/1000","v":0}]
[null,null,null,0,{"$f":"IFERROR(INDEX($E$19:$E$117, MATCH(0,IF(ISBLANK($E$19:$E$117),1,COUNTIF(E$181:$E247, $E$19:$E$117)), 0)),\"\")","v":""},0]
[null,null,null,0,{"$f":"IFERROR(INDEX($E$19:$E$117, MATCH(0,IF(ISBLANK($E$19:$E$117),1,COUNTIF(E$181:$E248, $E$19:$E$117)), 0)),\"\")","v":""},0]
[null,null,null,0,{"$f":"IFERROR(INDEX($E$19:$E$117, MATCH(0,IF(ISBLANK($E$19:$E$117),1,COUNTIF(E$181:$E249, $E$19:$E$117)), 0)),\"\")","v":""},0]
[null,null,null,0,{"$f":"IFERROR(INDEX($E$19:$E$117, MATCH(0,IF(ISBLANK($E$19:$E$117),1,COUNTIF(E$181:$E250, $E$19:$E$117)), 0)),\"\")","v":""},0]
[null,null,null,0,{"$f":"IFERROR(INDEX($E$19:$E$117, MATCH(0,IF(ISBLANK($E$19:$E$117),1,COUNTIF(E$181:$E251, $E$19:$E$117)), 0)),\"\")","v":""},0]
[null,null,null,0,{"$f":"IFERROR(INDEX($E$19:$E$117, MATCH(0,IF(ISBLANK($E$19:$E$117),1,COUNTIF(E$181:$E252, $E$19:$E$117)), 0)),\"\")","v":""},0]
[null,null,null,0,{"$f":"IFERROR(INDEX($E$19:$E$117, MATCH(0,IF(ISBLANK($E$19:$E$117),1,COUNTIF(E$181:$E253, $E$19:$E$117)), 0)),\"\")","v":""},0]
[null,null,null,0,{"$f":"IFERROR(INDEX($E$19:$E$117, MATCH(0,IF(ISBLANK($E$19:$E$117),1,COUNTIF(E$181:$E254, $E$19:$E$117)), 0)),\"\")","v":""},0]
[null,null,null,0,{"$f":"IFERROR(INDEX($E$19:$E$117, MATCH(0,IF(ISBLANK($E$19:$E$117),1,COUNTIF(E$181:$E255, $E$19:$E$117)), 0)),\"\")","v":""},0]
[null,null,null,0,{"$f":"IFERROR(INDEX($E$19:$E$117, MATCH(0,IF(ISBLANK($E$19:$E$117),1,COUNTIF(E$181:$E256, $E$19:$E$117)), 0)),\"\")","v":""},0]
[null,null,null,0,{"$f":"IFERROR(INDEX($E$19:$E$117, MATCH(0,IF(ISBLANK($E$19:$E$117),1,COUNTIF(E$181:$E257, $E$19:$E$117)), 0)),\"\")","v":""},0]
[null,null,null,0,{"$f":"IFERROR(INDEX($E$19:$E$117, MATCH(0,IF(ISBLANK($E$19:$E$117),1,COUNTIF(E$181:$E258, $E$19:$E$117)), 0)),\"\")","v":""},0]
[null,null,null,0,{"$f":"IFERROR(INDEX($E$19:$E$117, MATCH(0,IF(ISBLANK($E$19:$E$117),1,COUNTIF(E$181:$E259, $E$19:$E$117)), 0)),\"\")","v":""},0]
[null,null,null,0,{"$f":"IFERROR(INDEX($E$19:$E$117, MATCH(0,IF(ISBLANK($E$19:$E$117),1,COUNTIF(E$181:$E260, $E$19:$E$117)), 0)),\"\")","v":""},0]
[null,null,null,0,{"$f":"IFERROR(INDEX($E$19:$E$117, MATCH(0,IF(ISBLANK($E$19:$E$117),1,COUNTIF(E$181:$E261, $E$19:$E$117)), 0)),\"\")","v":""},0]
[null,null,null,0,{"$f":"IFERROR(INDEX($E$19:$E$117, MATCH(0,IF(ISBLANK($E$19:$E$117),1,COUNTIF(E$181:$E262, $E$19:$E$117)), 0)),\"\")","v":""},0]
[null,null,null,0,{"$f":"IFERROR(INDEX($E$19:$E$117, MATCH(0,IF(ISBLANK($E$19:$E$117),1,COUNTIF(E$181:$E263, $E$19:$E$117)), 0)),\"\")","v":""},0]
[null,null,null,0,{"$f":"IFERROR(INDEX($E$19:$E$117, MATCH(0,IF(ISBLANK($E$19:$E$117),1,COUNTIF(E$181:$E264, $E$19:$E$117)), 0)),\"\")","v":""},0]
[null,null,null,0,{"$f":"IFERROR(INDEX($E$19:$E$117, MATCH(0,IF(ISBLANK($E$19:$E$117),1,COUNTIF(E$181:$E265, $E$19:$E$117)), 0)),\"\")","v":""},0]
[null,null,null,0,{"$f":"IFERROR(INDEX($E$19:$E$117, MATCH(0,IF(ISBLANK($E$19:$E$117),1,COUNTIF(E$181:$E266, $E$19:$E$117)), 0)),\"\")","v":""},0]
[null,null,null,0,{"$f":"IFERROR(INDEX($E$19:$E$117, MATCH(0,IF(ISBLANK($E$19:$E$117),1,COUNTIF(E$181:$E267, $E$19:$E$117)), 0)),\"\")","v":""},0]
[null,null,null,0,{"$f":"IFERROR(INDEX($E$19:$E$117, MATCH(0,IF(ISBLANK($E$19:$E$117),1,COUNTIF(E$181:$E268, $E$19:$E$117)), 0)),\"\")","v":""},0]
[null,null,null,0,{"$f":"IFERROR(INDEX($E$19:$E$117, MATCH(0,IF(ISBLANK($E$19:$E$117),1,COUNTIF(E$181:$E269, $E$19:$E$117)), 0)),\"\")","v":""},0]
[null,null,null,0,{"$f":"IFERROR(INDEX($E$19:$E$117, MATCH(0,IF(ISBLANK($E$19:$E$117),1,COUNTIF(E$181:$E270, $E$19:$E$117)), 0)),\"\")","v":""},0]
[null,null,null,0,{"$f":"IFERROR(INDEX($E$19:$E$117, MATCH(0,IF(ISBLANK($E$19:$E$117),1,COUNTIF(E$181:$E271, $E$19:$E$117)), 0)),\"\")","v":""},0]
[null,null,null,0,{"$f":"IFERROR(INDEX($E$19:$E$117, MATCH(0,IF(ISBLANK($E$19:$E$117),1,COUNTIF(E$181:$E272, $E$19:$E$117)), 0)),\"\")","v":""},0]
[null,null,null,0,{"$f":"IFERROR(INDEX($E$19:$E$117, MATCH(0,IF(ISBLANK($E$19:$E$117),1,COUNTIF(E$181:$E273, $E$19:$E$117)), 0)),\"\")","v":""},0]
[null,null,null,0,{"$f":"IFERROR(INDEX($E$19:$E$117, MATCH(0,IF(ISBLANK($E$19:$E$117),1,COUNTIF(E$181:$E274, $E$19:$E$117)), 0)),\"\")","v":""},0]
[null,null,null,0,{"$f":"IFERROR(INDEX($E$19:$E$117, MATCH(0,IF(ISBLANK($E$19:$E$117),1,COUNTIF(E$181:$E275, $E$19:$E$117)), 0)),\"\")","v":""},0]
[null,null,null,0,{"$f":"IFERROR(INDEX($E$19:$E$117, MATCH(0,IF(ISBLANK($E$19:$E$117),1,COUNTIF(E$181:$E276, $E$19:$E$117)), 0)),\"\")","v":""},0]
[null,null,null,0,{"$f":"IFERROR(INDEX($E$19:$E$117, MATCH(0,IF(ISBLANK($E$19:$E$117),1,COUNTIF(E$181:$E277, $E$19:$E$117)), 0)),\"\")","v":""},0]
[null,null,null,0,{"$f":"IFERROR(INDEX($E$19:$E$117, MATCH(0,IF(ISBLANK($E$19:$E$117),1,COUNTIF(E$181:$E278, $E$19:$E$117)), 0)),\"\")","v":""},0]
[null,null,null,0,{"$f":"IFERROR(INDEX($E$19:$E$117, MATCH(0,IF(ISBLANK($E$19:$E$117),1,COUNTIF(E$181:$E279, $E$19:$E$117)), 0)),\"\")","v":""},0]
[null,null,null,500]
[null,null,null,500]
[null,null,null,500]
[null,null,null,500]
[null,null,null,500]
[null,null,null,500]
[null,null,null,500]
[null,null,null,500]
[null,null,null,500]
[null,null,null,500]
[null,null,null,500]
[null,null,null,500,"unique countires"]
[{"$f":"SUM(D293:D391)/99","v":2},null,null,{"$f":"IF(E293=$C$182,0,99)","v":99},{"$f":"IFERROR(INDEX($F$19:$F$117, MATCH(0,IF(ISBLANK($F$19:$F$117),1,COUNTIF(E$292:$E292, $F$19:$F$117)), 0)),\"\")","v":2},{"$f":"SUMIF(F$19:F$117,E293,$Q$19:$Q$118)","v":113500}]
[null,null,null,{"$f":"IF(E294=$C$182,0,99)","v":99},{"$f":"IFERROR(INDEX($F$19:$F$117, MATCH(0,IF(ISBLANK($F$19:$F$117),1,COUNTIF(E$292:$E293, $F$19:$F$117)), 0)),\"\")","v":3},0]
[null,null,null,0,{"$f":"IFERROR(INDEX($F$19:$F$117, MATCH(0,IF(ISBLANK($F$19:$F$117),1,COUNTIF(E$292:$E294, $F$19:$F$117)), 0)),\"\")","v":""},0]
[null,null,null,0,{"$f":"IFERROR(INDEX($F$19:$F$117, MATCH(0,IF(ISBLANK($F$19:$F$117),1,COUNTIF(E$292:$E295, $F$19:$F$117)), 0)),\"\")","v":""},0]
[null,null,null,0,{"$f":"IFERROR(INDEX($F$19:$F$117, MATCH(0,IF(ISBLANK($F$19:$F$117),1,COUNTIF(E$292:$E296, $F$19:$F$117)), 0)),\"\")","v":""},0]
[null,null,null,0,{"$f":"IFERROR(INDEX($F$19:$F$117, MATCH(0,IF(ISBLANK($F$19:$F$117),1,COUNTIF(E$292:$E297, $F$19:$F$117)), 0)),\"\")","v":""},0]
[null,null,null,0,{"$f":"IFERROR(INDEX($F$19:$F$117, MATCH(0,IF(ISBLANK($F$19:$F$117),1,COUNTIF(E$292:$E298, $F$19:$F$117)), 0)),\"\")","v":""},0]
[null,null,null,0,{"$f":"IFERROR(INDEX($F$19:$F$117, MATCH(0,IF(ISBLANK($F$19:$F$117),1,COUNTIF(E$292:$E299, $F$19:$F$117)), 0)),\"\")","v":""},0]
[null,null,null,0,{"$f":"IFERROR(INDEX($F$19:$F$117, MATCH(0,IF(ISBLANK($F$19:$F$117),1,COUNTIF(E$292:$E300, $F$19:$F$117)), 0)),\"\")","v":""},0]
[null,null,null,0,{"$f":"IFERROR(INDEX($F$19:$F$117, MATCH(0,IF(ISBLANK($F$19:$F$117),1,COUNTIF(E$292:$E301, $F$19:$F$117)), 0)),\"\")","v":""},0]
[null,null,null,0,{"$f":"IFERROR(INDEX($F$19:$F$117, MATCH(0,IF(ISBLANK($F$19:$F$117),1,COUNTIF(E$292:$E302, $F$19:$F$117)), 0)),\"\")","v":""},0]
[null,null,null,0,{"$f":"IFERROR(INDEX($F$19:$F$117, MATCH(0,IF(ISBLANK($F$19:$F$117),1,COUNTIF(E$292:$E303, $F$19:$F$117)), 0)),\"\")","v":""},0]
[null,null,null,0,{"$f":"IFERROR(INDEX($F$19:$F$117, MATCH(0,IF(ISBLANK($F$19:$F$117),1,COUNTIF(E$292:$E304, $F$19:$F$117)), 0)),\"\")","v":""},0]
[null,null,null,0,{"$f":"IFERROR(INDEX($F$19:$F$117, MATCH(0,IF(ISBLANK($F$19:$F$117),1,COUNTIF(E$292:$E305, $F$19:$F$117)), 0)),\"\")","v":""},0]
[null,null,null,0,{"$f":"IFERROR(INDEX($F$19:$F$117, MATCH(0,IF(ISBLANK($F$19:$F$117),1,COUNTIF(E$292:$E306, $F$19:$F$117)), 0)),\"\")","v":""},0]
[null,null,null,0,{"$f":"IFERROR(INDEX($F$19:$F$117, MATCH(0,IF(ISBLANK($F$19:$F$117),1,COUNTIF(E$292:$E307, $F$19:$F$117)), 0)),\"\")","v":""},0]
[null,null,null,0,{"$f":"IFERROR(INDEX($F$19:$F$117, MATCH(0,IF(ISBLANK($F$19:$F$117),1,COUNTIF(E$292:$E308, $F$19:$F$117)), 0)),\"\")","v":""},0]
[null,null,null,0,{"$f":"IFERROR(INDEX($F$19:$F$117, MATCH(0,IF(ISBLANK($F$19:$F$117),1,COUNTIF(E$292:$E309, $F$19:$F$117)), 0)),\"\")","v":""},0]
[null,null,null,0,{"$f":"IFERROR(INDEX($F$19:$F$117, MATCH(0,IF(ISBLANK($F$19:$F$117),1,COUNTIF(E$292:$E310, $F$19:$F$117)), 0)),\"\")","v":""},0]
[null,null,null,0,{"$f":"IFERROR(INDEX($F$19:$F$117, MATCH(0,IF(ISBLANK($F$19:$F$117),1,COUNTIF(E$292:$E311, $F$19:$F$117)), 0)),\"\")","v":""},0]
[null,null,null,0,{"$f":"IFERROR(INDEX($F$19:$F$117, MATCH(0,IF(ISBLANK($F$19:$F$117),1,COUNTIF(E$292:$E312, $F$19:$F$117)), 0)),\"\")","v":""},0]
[null,null,null,0,{"$f":"IFERROR(INDEX($F$19:$F$117, MATCH(0,IF(ISBLANK($F$19:$F$117),1,COUNTIF(E$292:$E313, $F$19:$F$117)), 0)),\"\")","v":""},0]
[null,null,null,0,{"$f":"IFERROR(INDEX($F$19:$F$117, MATCH(0,IF(ISBLANK($F$19:$F$117),1,COUNTIF(E$292:$E314, $F$19:$F$117)), 0)),\"\")","v":""},0]
[null,null,null,0,{"$f":"IFERROR(INDEX($F$19:$F$117, MATCH(0,IF(ISBLANK($F$19:$F$117),1,COUNTIF(E$292:$E315, $F$19:$F$117)), 0)),\"\")","v":""},0]
[null,null,null,0,{"$f":"IFERROR(INDEX($F$19:$F$117, MATCH(0,IF(ISBLANK($F$19:$F$117),1,COUNTIF(E$292:$E316, $F$19:$F$117)), 0)),\"\")","v":""},0]
[null,null,null,0,{"$f":"IFERROR(INDEX($F$19:$F$117, MATCH(0,IF(ISBLANK($F$19:$F$117),1,COUNTIF(E$292:$E317, $F$19:$F$117)), 0)),\"\")","v":""},0]
[null,null,null,0,{"$f":"IFERROR(INDEX($F$19:$F$117, MATCH(0,IF(ISBLANK($F$19:$F$117),1,COUNTIF(E$292:$E318, $F$19:$F$117)), 0)),\"\")","v":""},0]
[null,null,null,0,{"$f":"IFERROR(INDEX($F$19:$F$117, MATCH(0,IF(ISBLANK($F$19:$F$117),1,COUNTIF(E$292:$E319, $F$19:$F$117)), 0)),\"\")","v":""},0]
[null,null,null,0,{"$f":"IFERROR(INDEX($F$19:$F$117, MATCH(0,IF(ISBLANK($F$19:$F$117),1,COUNTIF(E$292:$E320, $F$19:$F$117)), 0)),\"\")","v":""},0]
[null,null,null,0,{"$f":"IFERROR(INDEX($F$19:$F$117, MATCH(0,IF(ISBLANK($F$19:$F$117),1,COUNTIF(E$292:$E321, $F$19:$F$117)), 0)),\"\")","v":""},0]
[null,null,null,0,{"$f":"IFERROR(INDEX($F$19:$F$117, MATCH(0,IF(ISBLANK($F$19:$F$117),1,COUNTIF(E$292:$E322, $F$19:$F$117)), 0)),\"\")","v":""},0]
[null,null,null,0,{"$f":"IFERROR(INDEX($F$19:$F$117, MATCH(0,IF(ISBLANK($F$19:$F$117),1,COUNTIF(E$292:$E323, $F$19:$F$117)), 0)),\"\")","v":""},0]
[null,null,null,0,{"$f":"IFERROR(INDEX($F$19:$F$117, MATCH(0,IF(ISBLANK($F$19:$F$117),1,COUNTIF(E$292:$E324, $F$19:$F$117)), 0)),\"\")","v":""},0]
[null,null,null,0,{"$f":"IFERROR(INDEX($F$19:$F$117, MATCH(0,IF(ISBLANK($F$19:$F$117),1,COUNTIF(E$292:$E325, $F$19:$F$117)), 0)),\"\")","v":""},0]
[null,null,null,0,{"$f":"IFERROR(INDEX($F$19:$F$117, MATCH(0,IF(ISBLANK($F$19:$F$117),1,COUNTIF(E$292:$E326, $F$19:$F$117)), 0)),\"\")","v":""},0]
[null,null,null,0,{"$f":"IFERROR(INDEX($F$19:$F$117, MATCH(0,IF(ISBLANK($F$19:$F$117),1,COUNTIF(E$292:$E327, $F$19:$F$117)), 0)),\"\")","v":""},0]
[null,null,null,0,{"$f":"IFERROR(INDEX($F$19:$F$117, MATCH(0,IF(ISBLANK($F$19:$F$117),1,COUNTIF(E$292:$E328, $F$19:$F$117)), 0)),\"\")","v":""},0]
[null,null,null,0,{"$f":"IFERROR(INDEX($F$19:$F$117, MATCH(0,IF(ISBLANK($F$19:$F$117),1,COUNTIF(E$292:$E329, $F$19:$F$117)), 0)),\"\")","v":""},0]
[null,null,null,0,{"$f":"IFERROR(INDEX($F$19:$F$117, MATCH(0,IF(ISBLANK($F$19:$F$117),1,COUNTIF(E$292:$E330, $F$19:$F$117)), 0)),\"\")","v":""},0]
[null,null,null,0,{"$f":"IFERROR(INDEX($F$19:$F$117, MATCH(0,IF(ISBLANK($F$19:$F$117),1,COUNTIF(E$292:$E331, $F$19:$F$117)), 0)),\"\")","v":""},0]
[null,null,null,0,{"$f":"IFERROR(INDEX($F$19:$F$117, MATCH(0,IF(ISBLANK($F$19:$F$117),1,COUNTIF(E$292:$E332, $F$19:$F$117)), 0)),\"\")","v":""},0]
[null,null,null,0,{"$f":"IFERROR(INDEX($F$19:$F$117, MATCH(0,IF(ISBLANK($F$19:$F$117),1,COUNTIF(E$292:$E333, $F$19:$F$117)), 0)),\"\")","v":""},0]
[null,null,null,0,{"$f":"IFERROR(INDEX($F$19:$F$117, MATCH(0,IF(ISBLANK($F$19:$F$117),1,COUNTIF(E$292:$E334, $F$19:$F$117)), 0)),\"\")","v":""},0]
[null,null,null,0,{"$f":"IFERROR(INDEX($F$19:$F$117, MATCH(0,IF(ISBLANK($F$19:$F$117),1,COUNTIF(E$292:$E335, $F$19:$F$117)), 0)),\"\")","v":""},0]
[null,null,null,0,{"$f":"IFERROR(INDEX($F$19:$F$117, MATCH(0,IF(ISBLANK($F$19:$F$117),1,COUNTIF(E$292:$E336, $F$19:$F$117)), 0)),\"\")","v":""},0]
[null,null,null,0,{"$f":"IFERROR(INDEX($F$19:$F$117, MATCH(0,IF(ISBLANK($F$19:$F$117),1,COUNTIF(E$292:$E337, $F$19:$F$117)), 0)),\"\")","v":""},0]
[null,null,null,0,{"$f":"IFERROR(INDEX($F$19:$F$117, MATCH(0,IF(ISBLANK($F$19:$F$117),1,COUNTIF(E$292:$E338, $F$19:$F$117)), 0)),\"\")","v":""},0]
[null,null,null,0,{"$f":"IFERROR(INDEX($F$19:$F$117, MATCH(0,IF(ISBLANK($F$19:$F$117),1,COUNTIF(E$292:$E339, $F$19:$F$117)), 0)),\"\")","v":""},0]
[null,null,null,0,{"$f":"IFERROR(INDEX($F$19:$F$117, MATCH(0,IF(ISBLANK($F$19:$F$117),1,COUNTIF(E$292:$E340, $F$19:$F$117)), 0)),\"\")","v":""},0]
[null,null,null,0,{"$f":"IFERROR(INDEX($F$19:$F$117, MATCH(0,IF(ISBLANK($F$19:$F$117),1,COUNTIF(E$292:$E341, $F$19:$F$117)), 0)),\"\")","v":""},0]
[null,null,null,0,{"$f":"IFERROR(INDEX($F$19:$F$117, MATCH(0,IF(ISBLANK($F$19:$F$117),1,COUNTIF(E$292:$E342, $F$19:$F$117)), 0)),\"\")","v":""},0]
[null,null,null,0,{"$f":"IFERROR(INDEX($F$19:$F$117, MATCH(0,IF(ISBLANK($F$19:$F$117),1,COUNTIF(E$292:$E343, $F$19:$F$117)), 0)),\"\")","v":""},0]
[null,null,null,0,{"$f":"IFERROR(INDEX($F$19:$F$117, MATCH(0,IF(ISBLANK($F$19:$F$117),1,COUNTIF(E$292:$E344, $F$19:$F$117)), 0)),\"\")","v":""},0]
[null,null,null,0,{"$f":"IFERROR(INDEX($F$19:$F$117, MATCH(0,IF(ISBLANK($F$19:$F$117),1,COUNTIF(E$292:$E345, $F$19:$F$117)), 0)),\"\")","v":""},0]
[null,null,null,0,{"$f":"IFERROR(INDEX($F$19:$F$117, MATCH(0,IF(ISBLANK($F$19:$F$117),1,COUNTIF(E$292:$E346, $F$19:$F$117)), 0)),\"\")","v":""},0]
[null,null,null,0,{"$f":"IFERROR(INDEX($F$19:$F$117, MATCH(0,IF(ISBLANK($F$19:$F$117),1,COUNTIF(E$292:$E347, $F$19:$F$117)), 0)),\"\")","v":""},0]
[null,null,null,0,{"$f":"IFERROR(INDEX($F$19:$F$117, MATCH(0,IF(ISBLANK($F$19:$F$117),1,COUNTIF(E$292:$E348, $F$19:$F$117)), 0)),\"\")","v":""},0]
[null,null,null,0,{"$f":"IFERROR(INDEX($F$19:$F$117, MATCH(0,IF(ISBLANK($F$19:$F$117),1,COUNTIF(E$292:$E349, $F$19:$F$117)), 0)),\"\")","v":""},0]
[null,null,null,0,{"$f":"IFERROR(INDEX($F$19:$F$117, MATCH(0,IF(ISBLANK($F$19:$F$117),1,COUNTIF(E$292:$E350, $F$19:$F$117)), 0)),\"\")","v":""},0]
[null,null,null,0,{"$f":"IFERROR(INDEX($F$19:$F$117, MATCH(0,IF(ISBLANK($F$19:$F$117),1,COUNTIF(E$292:$E351, $F$19:$F$117)), 0)),\"\")","v":""},0]
[null,null,null,0,{"$f":"IFERROR(INDEX($F$19:$F$117, MATCH(0,IF(ISBLANK($F$19:$F$117),1,COUNTIF(E$292:$E352, $F$19:$F$117)), 0)),\"\")","v":""},0]
[null,null,null,0,{"$f":"IFERROR(INDEX($F$19:$F$117, MATCH(0,IF(ISBLANK($F$19:$F$117),1,COUNTIF(E$292:$E353, $F$19:$F$117)), 0)),\"\")","v":""},0]
[null,null,null,0,{"$f":"IFERROR(INDEX($F$19:$F$117, MATCH(0,IF(ISBLANK($F$19:$F$117),1,COUNTIF(E$292:$E354, $F$19:$F$117)), 0)),\"\")","v":""},0]
[null,null,null,0,{"$f":"IFERROR(INDEX($F$19:$F$117, MATCH(0,IF(ISBLANK($F$19:$F$117),1,COUNTIF(E$292:$E355, $F$19:$F$117)), 0)),\"\")","v":""},0]
[null,null,null,0,{"$f":"IFERROR(INDEX($F$19:$F$117, MATCH(0,IF(ISBLANK($F$19:$F$117),1,COUNTIF(E$292:$E356, $F$19:$F$117)), 0)),\"\")","v":""},{"$f":"SUMIF(F$19:F$117,E357,$Q$19:$Q$118)","v":0}]
[null,null,null,{"$f":"IF(E358=$C$182,0,99)","v":0},{"$f":"IFERROR(INDEX($F$19:$F$117, MATCH(0,IF(ISBLANK($F$19:$F$117),1,COUNTIF(E$292:$E357, $F$19:$F$117)), 0)),\"\")","v":""},0]
[null,null,null,0,{"$f":"IFERROR(INDEX($F$19:$F$117, MATCH(0,IF(ISBLANK($F$19:$F$117),1,COUNTIF(E$292:$E358, $F$19:$F$117)), 0)),\"\")","v":""},0]
[null,null,null,0,{"$f":"IFERROR(INDEX($F$19:$F$117, MATCH(0,IF(ISBLANK($F$19:$F$117),1,COUNTIF(E$292:$E359, $F$19:$F$117)), 0)),\"\")","v":""},0]
[null,null,null,0,{"$f":"IFERROR(INDEX($F$19:$F$117, MATCH(0,IF(ISBLANK($F$19:$F$117),1,COUNTIF(E$292:$E360, $F$19:$F$117)), 0)),\"\")","v":""},0]
[null,null,null,0,{"$f":"IFERROR(INDEX($F$19:$F$117, MATCH(0,IF(ISBLANK($F$19:$F$117),1,COUNTIF(E$292:$E361, $F$19:$F$117)), 0)),\"\")","v":""},0]
[null,null,null,0,{"$f":"IFERROR(INDEX($F$19:$F$117, MATCH(0,IF(ISBLANK($F$19:$F$117),1,COUNTIF(E$292:$E362, $F$19:$F$117)), 0)),\"\")","v":""},0]
[null,null,null,0,{"$f":"IFERROR(INDEX($F$19:$F$117, MATCH(0,IF(ISBLANK($F$19:$F$117),1,COUNTIF(E$292:$E363, $F$19:$F$117)), 0)),\"\")","v":""},0]
[null,null,null,0,{"$f":"IFERROR(INDEX($F$19:$F$117, MATCH(0,IF(ISBLANK($F$19:$F$117),1,COUNTIF(E$292:$E364, $F$19:$F$117)), 0)),\"\")","v":""},0]
[null,null,null,0,{"$f":"IFERROR(INDEX($F$19:$F$117, MATCH(0,IF(ISBLANK($F$19:$F$117),1,COUNTIF(E$292:$E365, $F$19:$F$117)), 0)),\"\")","v":""},0]
[null,null,null,0,{"$f":"IFERROR(INDEX($F$19:$F$117, MATCH(0,IF(ISBLANK($F$19:$F$117),1,COUNTIF(E$292:$E366, $F$19:$F$117)), 0)),\"\")","v":""},0]
[null,null,null,0,{"$f":"IFERROR(INDEX($F$19:$F$117, MATCH(0,IF(ISBLANK($F$19:$F$117),1,COUNTIF(E$292:$E367, $F$19:$F$117)), 0)),\"\")","v":""},0]
[null,null,null,0,{"$f":"IFERROR(INDEX($F$19:$F$117, MATCH(0,IF(ISBLANK($F$19:$F$117),1,COUNTIF(E$292:$E368, $F$19:$F$117)), 0)),\"\")","v":""},0]
[null,null,null,0,{"$f":"IFERROR(INDEX($F$19:$F$117, MATCH(0,IF(ISBLANK($F$19:$F$117),1,COUNTIF(E$292:$E369, $F$19:$F$117)), 0)),\"\")","v":""},0]
[null,null,null,0,{"$f":"IFERROR(INDEX($F$19:$F$117, MATCH(0,IF(ISBLANK($F$19:$F$117),1,COUNTIF(E$292:$E370, $F$19:$F$117)), 0)),\"\")","v":""},0]
[null,null,null,0,{"$f":"IFERROR(INDEX($F$19:$F$117, MATCH(0,IF(ISBLANK($F$19:$F$117),1,COUNTIF(E$292:$E371, $F$19:$F$117)), 0)),\"\")","v":""},0]
[null,null,null,0,{"$f":"IFERROR(INDEX($F$19:$F$117, MATCH(0,IF(ISBLANK($F$19:$F$117),1,COUNTIF(E$292:$E372, $F$19:$F$117)), 0)),\"\")","v":""},0]
[null,null,null,0,{"$f":"IFERROR(INDEX($F$19:$F$117, MATCH(0,IF(ISBLANK($F$19:$F$117),1,COUNTIF(E$292:$E373, $F$19:$F$117)), 0)),\"\")","v":""},0]
[null,null,null,0,{"$f":"IFERROR(INDEX($F$19:$F$117, MATCH(0,IF(ISBLANK($F$19:$F$117),1,COUNTIF(E$292:$E374, $F$19:$F$117)), 0)),\"\")","v":""},0]
[null,null,null,0,{"$f":"IFERROR(INDEX($F$19:$F$117, MATCH(0,IF(ISBLANK($F$19:$F$117),1,COUNTIF(E$292:$E375, $F$19:$F$117)), 0)),\"\")","v":""},0]
[null,null,null,0,{"$f":"IFERROR(INDEX($F$19:$F$117, MATCH(0,IF(ISBLANK($F$19:$F$117),1,COUNTIF(E$292:$E376, $F$19:$F$117)), 0)),\"\")","v":""},0]
[null,null,null,0,{"$f":"IFERROR(INDEX($F$19:$F$117, MATCH(0,IF(ISBLANK($F$19:$F$117),1,COUNTIF(E$292:$E377, $F$19:$F$117)), 0)),\"\")","v":""},0]
[null,null,null,0,{"$f":"IFERROR(INDEX($F$19:$F$117, MATCH(0,IF(ISBLANK($F$19:$F$117),1,COUNTIF(E$292:$E378, $F$19:$F$117)), 0)),\"\")","v":""},0]
[null,null,null,0,{"$f":"IFERROR(INDEX($F$19:$F$117, MATCH(0,IF(ISBLANK($F$19:$F$117),1,COUNTIF(E$292:$E379, $F$19:$F$117)), 0)),\"\")","v":""},0]
[null,null,null,0,{"$f":"IFERROR(INDEX($F$19:$F$117, MATCH(0,IF(ISBLANK($F$19:$F$117),1,COUNTIF(E$292:$E380, $F$19:$F$117)), 0)),\"\")","v":""},0]
[null,null,null,0,{"$f":"IFERROR(INDEX($F$19:$F$117, MATCH(0,IF(ISBLANK($F$19:$F$117),1,COUNTIF(E$292:$E381, $F$19:$F$117)), 0)),\"\")","v":""},0]
[null,null,null,0,{"$f":"IFERROR(INDEX($F$19:$F$117, MATCH(0,IF(ISBLANK($F$19:$F$117),1,COUNTIF(E$292:$E382, $F$19:$F$117)), 0)),\"\")","v":""},0]
[null,null,null,0,{"$f":"IFERROR(INDEX($F$19:$F$117, MATCH(0,IF(ISBLANK($F$19:$F$117),1,COUNTIF(E$292:$E383, $F$19:$F$117)), 0)),\"\")","v":""},0]
[null,null,null,0,{"$f":"IFERROR(INDEX($F$19:$F$117, MATCH(0,IF(ISBLANK($F$19:$F$117),1,COUNTIF(E$292:$E384, $F$19:$F$117)), 0)),\"\")","v":""},0]
[null,null,null,0,{"$f":"IFERROR(INDEX($F$19:$F$117, MATCH(0,IF(ISBLANK($F$19:$F$117),1,COUNTIF(E$292:$E385, $F$19:$F$117)), 0)),\"\")","v":""},0]
[null,null,null,0,{"$f":"IFERROR(INDEX($F$19:$F$117, MATCH(0,IF(ISBLANK($F$19:$F$117),1,COUNTIF(E$292:$E386, $F$19:$F$117)), 0)),\"\")","v":""},0]
[null,null,null,0,{"$f":"IFERROR(INDEX($F$19:$F$117, MATCH(0,IF(ISBLANK($F$19:$F$117),1,COUNTIF(E$292:$E387, $F$19:$F$117)), 0)),\"\")","v":""},0]
[null,null,null,0,{"$f":"IFERROR(INDEX($F$19:$F$117, MATCH(0,IF(ISBLANK($F$19:$F$117),1,COUNTIF(E$292:$E388, $F$19:$F$117)), 0)),\"\")","v":""},0]
[null,null,null,0,{"$f":"IFERROR(INDEX($F$19:$F$117, MATCH(0,IF(ISBLANK($F$19:$F$117),1,COUNTIF(E$292:$E389, $F$19:$F$117)), 0)),\"\")","v":""},0]
[null,null,null,0,{"$f":"IFERROR(INDEX($F$19:$F$117, MATCH(0,IF(ISBLANK($F$19:$F$117),1,COUNTIF(E$292:$E390, $F$19:$F$117)), 0)),\"\")","v":""},0]
[null,null,null,500]
[null,null,null,500]
[null,null,null,500]
[null,null,null,500]
[null,null,null,500]
[null,null,null,500]
[null,null,null,500]
[null,null,null,500]
[null,null,null,500]
[null,null,null,500,"unique types"]
[{"$f":"SUM(D402:D500)/99","v":3},null,null,{"$f":"IF(E402=$C$182,0,99)","v":99},{"$f":"IFERROR(INDEX($A$19:$A$117, MATCH(0,IF(ISBLANK($A$19:$A$117),1,COUNTIF(E$401:$E401, $A$19:$A$117)), 0)),\"\")","v":4},{"$f":"SUMIF(A$19:A$117,E402,$Q$19:$Q$118)","v":113500}]
[null,null,null,{"$f":"IF(E403=$C$182,0,99)","v":99},{"$f":"IFERROR(INDEX($A$19:$A$117, MATCH(0,IF(ISBLANK($A$19:$A$117),1,COUNTIF(E$401:$E402, $A$19:$A$117)), 0)),\"\")","v":5},0]
[null,null,null,99,{"$f":"IFERROR(INDEX($A$19:$A$117, MATCH(0,IF(ISBLANK($A$19:$A$117),1,COUNTIF(E$401:$E403, $A$19:$A$117)), 0)),\"\")","v":3},0]
[null,null,null,0,{"$f":"IFERROR(INDEX($A$19:$A$117, MATCH(0,IF(ISBLANK($A$19:$A$117),1,COUNTIF(E$401:$E404, $A$19:$A$117)), 0)),\"\")","v":""},0]
[null,null,null,0,{"$f":"IFERROR(INDEX($A$19:$A$117, MATCH(0,IF(ISBLANK($A$19:$A$117),1,COUNTIF(E$401:$E405, $A$19:$A$117)), 0)),\"\")","v":""},0]
[null,null,null,0,{"$f":"IFERROR(INDEX($A$19:$A$117, MATCH(0,IF(ISBLANK($A$19:$A$117),1,COUNTIF(E$401:$E406, $A$19:$A$117)), 0)),\"\")","v":""},0]
[null,null,null,0,{"$f":"IFERROR(INDEX($A$19:$A$117, MATCH(0,IF(ISBLANK($A$19:$A$117),1,COUNTIF(E$401:$E407, $A$19:$A$117)), 0)),\"\")","v":""},0]
[null,null,null,0,{"$f":"IFERROR(INDEX($A$19:$A$117, MATCH(0,IF(ISBLANK($A$19:$A$117),1,COUNTIF(E$401:$E408, $A$19:$A$117)), 0)),\"\")","v":""},0]
[null,null,null,0,{"$f":"IFERROR(INDEX($A$19:$A$117, MATCH(0,IF(ISBLANK($A$19:$A$117),1,COUNTIF(E$401:$E409, $A$19:$A$117)), 0)),\"\")","v":""},0]
[null,null,null,0,{"$f":"IFERROR(INDEX($A$19:$A$117, MATCH(0,IF(ISBLANK($A$19:$A$117),1,COUNTIF(E$401:$E410, $A$19:$A$117)), 0)),\"\")","v":""},0]
[null,null,null,0,{"$f":"IFERROR(INDEX($A$19:$A$117, MATCH(0,IF(ISBLANK($A$19:$A$117),1,COUNTIF(E$401:$E411, $A$19:$A$117)), 0)),\"\")","v":""},0]
[null,null,null,0,{"$f":"IFERROR(INDEX($A$19:$A$117, MATCH(0,IF(ISBLANK($A$19:$A$117),1,COUNTIF(E$401:$E412, $A$19:$A$117)), 0)),\"\")","v":""},0]
[null,null,null,0,{"$f":"IFERROR(INDEX($A$19:$A$117, MATCH(0,IF(ISBLANK($A$19:$A$117),1,COUNTIF(E$401:$E413, $A$19:$A$117)), 0)),\"\")","v":""},0]
[null,null,null,0,{"$f":"IFERROR(INDEX($A$19:$A$117, MATCH(0,IF(ISBLANK($A$19:$A$117),1,COUNTIF(E$401:$E414, $A$19:$A$117)), 0)),\"\")","v":""},0]
[null,null,null,0,{"$f":"IFERROR(INDEX($A$19:$A$117, MATCH(0,IF(ISBLANK($A$19:$A$117),1,COUNTIF(E$401:$E415, $A$19:$A$117)), 0)),\"\")","v":""},0]
[null,null,null,0,{"$f":"IFERROR(INDEX($A$19:$A$117, MATCH(0,IF(ISBLANK($A$19:$A$117),1,COUNTIF(E$401:$E416, $A$19:$A$117)), 0)),\"\")","v":""},0]
[null,null,null,0,{"$f":"IFERROR(INDEX($A$19:$A$117, MATCH(0,IF(ISBLANK($A$19:$A$117),1,COUNTIF(E$401:$E417, $A$19:$A$117)), 0)),\"\")","v":""},0]
[null,null,null,0,{"$f":"IFERROR(INDEX($A$19:$A$117, MATCH(0,IF(ISBLANK($A$19:$A$117),1,COUNTIF(E$401:$E418, $A$19:$A$117)), 0)),\"\")","v":""},0]
[null,null,null,0,{"$f":"IFERROR(INDEX($A$19:$A$117, MATCH(0,IF(ISBLANK($A$19:$A$117),1,COUNTIF(E$401:$E419, $A$19:$A$117)), 0)),\"\")","v":""},0]
[null,null,null,0,{"$f":"IFERROR(INDEX($A$19:$A$117, MATCH(0,IF(ISBLANK($A$19:$A$117),1,COUNTIF(E$401:$E420, $A$19:$A$117)), 0)),\"\")","v":""},0]
[null,null,null,0,{"$f":"IFERROR(INDEX($A$19:$A$117, MATCH(0,IF(ISBLANK($A$19:$A$117),1,COUNTIF(E$401:$E421, $A$19:$A$117)), 0)),\"\")","v":""},0]
[null,null,null,0,{"$f":"IFERROR(INDEX($A$19:$A$117, MATCH(0,IF(ISBLANK($A$19:$A$117),1,COUNTIF(E$401:$E422, $A$19:$A$117)), 0)),\"\")","v":""},0]
[null,null,null,0,{"$f":"IFERROR(INDEX($A$19:$A$117, MATCH(0,IF(ISBLANK($A$19:$A$117),1,COUNTIF(E$401:$E423, $A$19:$A$117)), 0)),\"\")","v":""},0]
[null,null,null,0,{"$f":"IFERROR(INDEX($A$19:$A$117, MATCH(0,IF(ISBLANK($A$19:$A$117),1,COUNTIF(E$401:$E424, $A$19:$A$117)), 0)),\"\")","v":""},0]
[null,null,null,0,{"$f":"IFERROR(INDEX($A$19:$A$117, MATCH(0,IF(ISBLANK($A$19:$A$117),1,COUNTIF(E$401:$E425, $A$19:$A$117)), 0)),\"\")","v":""},0]
[null,null,null,0,{"$f":"IFERROR(INDEX($A$19:$A$117, MATCH(0,IF(ISBLANK($A$19:$A$117),1,COUNTIF(E$401:$E426, $A$19:$A$117)), 0)),\"\")","v":""},0]
[null,null,null,0,{"$f":"IFERROR(INDEX($A$19:$A$117, MATCH(0,IF(ISBLANK($A$19:$A$117),1,COUNTIF(E$401:$E427, $A$19:$A$117)), 0)),\"\")","v":""},0]
[null,null,null,0,{"$f":"IFERROR(INDEX($A$19:$A$117, MATCH(0,IF(ISBLANK($A$19:$A$117),1,COUNTIF(E$401:$E428, $A$19:$A$117)), 0)),\"\")","v":""},0]
[null,null,null,0,{"$f":"IFERROR(INDEX($A$19:$A$117, MATCH(0,IF(ISBLANK($A$19:$A$117),1,COUNTIF(E$401:$E429, $A$19:$A$117)), 0)),\"\")","v":""},0]
[null,null,null,0,{"$f":"IFERROR(INDEX($A$19:$A$117, MATCH(0,IF(ISBLANK($A$19:$A$117),1,COUNTIF(E$401:$E430, $A$19:$A$117)), 0)),\"\")","v":""},0]
[null,null,null,0,{"$f":"IFERROR(INDEX($A$19:$A$117, MATCH(0,IF(ISBLANK($A$19:$A$117),1,COUNTIF(E$401:$E431, $A$19:$A$117)), 0)),\"\")","v":""},0]
[null,null,null,0,{"$f":"IFERROR(INDEX($A$19:$A$117, MATCH(0,IF(ISBLANK($A$19:$A$117),1,COUNTIF(E$401:$E432, $A$19:$A$117)), 0)),\"\")","v":""},0]
[null,null,null,0,{"$f":"IFERROR(INDEX($A$19:$A$117, MATCH(0,IF(ISBLANK($A$19:$A$117),1,COUNTIF(E$401:$E433, $A$19:$A$117)), 0)),\"\")","v":""},0]
[null,null,null,0,{"$f":"IFERROR(INDEX($A$19:$A$117, MATCH(0,IF(ISBLANK($A$19:$A$117),1,COUNTIF(E$401:$E434, $A$19:$A$117)), 0)),\"\")","v":""},0]
[null,null,null,0,{"$f":"IFERROR(INDEX($A$19:$A$117, MATCH(0,IF(ISBLANK($A$19:$A$117),1,COUNTIF(E$401:$E435, $A$19:$A$117)), 0)),\"\")","v":""},0]
[null,null,null,0,{"$f":"IFERROR(INDEX($A$19:$A$117, MATCH(0,IF(ISBLANK($A$19:$A$117),1,COUNTIF(E$401:$E436, $A$19:$A$117)), 0)),\"\")","v":""},0]
[null,null,null,0,{"$f":"IFERROR(INDEX($A$19:$A$117, MATCH(0,IF(ISBLANK($A$19:$A$117),1,COUNTIF(E$401:$E437, $A$19:$A$117)), 0)),\"\")","v":""},0]
[null,null,null,0,{"$f":"IFERROR(INDEX($A$19:$A$117, MATCH(0,IF(ISBLANK($A$19:$A$117),1,COUNTIF(E$401:$E438, $A$19:$A$117)), 0)),\"\")","v":""},0]
[null,null,null,0,{"$f":"IFERROR(INDEX($A$19:$A$117, MATCH(0,IF(ISBLANK($A$19:$A$117),1,COUNTIF(E$401:$E439, $A$19:$A$117)), 0)),\"\")","v":""},0]
[null,null,null,0,{"$f":"IFERROR(INDEX($A$19:$A$117, MATCH(0,IF(ISBLANK($A$19:$A$117),1,COUNTIF(E$401:$E440, $A$19:$A$117)), 0)),\"\")","v":""},0]
[null,null,null,0,{"$f":"IFERROR(INDEX($A$19:$A$117, MATCH(0,IF(ISBLANK($A$19:$A$117),1,COUNTIF(E$401:$E441, $A$19:$A$117)), 0)),\"\")","v":""},0]
[null,null,null,0,{"$f":"IFERROR(INDEX($A$19:$A$117, MATCH(0,IF(ISBLANK($A$19:$A$117),1,COUNTIF(E$401:$E442, $A$19:$A$117)), 0)),\"\")","v":""},0]
[null,null,null,0,{"$f":"IFERROR(INDEX($A$19:$A$117, MATCH(0,IF(ISBLANK($A$19:$A$117),1,COUNTIF(E$401:$E443, $A$19:$A$117)), 0)),\"\")","v":""},0]
[null,null,null,0,{"$f":"IFERROR(INDEX($A$19:$A$117, MATCH(0,IF(ISBLANK($A$19:$A$117),1,COUNTIF(E$401:$E444, $A$19:$A$117)), 0)),\"\")","v":""},0]
[null,null,null,0,{"$f":"IFERROR(INDEX($A$19:$A$117, MATCH(0,IF(ISBLANK($A$19:$A$117),1,COUNTIF(E$401:$E445, $A$19:$A$117)), 0)),\"\")","v":""},0]
[null,null,null,0,{"$f":"IFERROR(INDEX($A$19:$A$117, MATCH(0,IF(ISBLANK($A$19:$A$117),1,COUNTIF(E$401:$E446, $A$19:$A$117)), 0)),\"\")","v":""},0]
[null,null,null,0,{"$f":"IFERROR(INDEX($A$19:$A$117, MATCH(0,IF(ISBLANK($A$19:$A$117),1,COUNTIF(E$401:$E447, $A$19:$A$117)), 0)),\"\")","v":""},0]
[null,null,null,0,{"$f":"IFERROR(INDEX($A$19:$A$117, MATCH(0,IF(ISBLANK($A$19:$A$117),1,COUNTIF(E$401:$E448, $A$19:$A$117)), 0)),\"\")","v":""},0]
[null,null,null,0,{"$f":"IFERROR(INDEX($A$19:$A$117, MATCH(0,IF(ISBLANK($A$19:$A$117),1,COUNTIF(E$401:$E449, $A$19:$A$117)), 0)),\"\")","v":""},0]
[null,null,null,0,{"$f":"IFERROR(INDEX($A$19:$A$117, MATCH(0,IF(ISBLANK($A$19:$A$117),1,COUNTIF(E$401:$E450, $A$19:$A$117)), 0)),\"\")","v":""},0]
[null,null,null,0,{"$f":"IFERROR(INDEX($A$19:$A$117, MATCH(0,IF(ISBLANK($A$19:$A$117),1,COUNTIF(E$401:$E451, $A$19:$A$117)), 0)),\"\")","v":""},0]
[null,null,null,0,{"$f":"IFERROR(INDEX($A$19:$A$117, MATCH(0,IF(ISBLANK($A$19:$A$117),1,COUNTIF(E$401:$E452, $A$19:$A$117)), 0)),\"\")","v":""},0]
[null,null,null,0,{"$f":"IFERROR(INDEX($A$19:$A$117, MATCH(0,IF(ISBLANK($A$19:$A$117),1,COUNTIF(E$401:$E453, $A$19:$A$117)), 0)),\"\")","v":""},0]
[null,null,null,0,{"$f":"IFERROR(INDEX($A$19:$A$117, MATCH(0,IF(ISBLANK($A$19:$A$117),1,COUNTIF(E$401:$E454, $A$19:$A$117)), 0)),\"\")","v":""},0]
[null,null,null,0,{"$f":"IFERROR(INDEX($A$19:$A$117, MATCH(0,IF(ISBLANK($A$19:$A$117),1,COUNTIF(E$401:$E455, $A$19:$A$117)), 0)),\"\")","v":""},0]
[null,null,null,0,{"$f":"IFERROR(INDEX($A$19:$A$117, MATCH(0,IF(ISBLANK($A$19:$A$117),1,COUNTIF(E$401:$E456, $A$19:$A$117)), 0)),\"\")","v":""},0]
[null,null,null,0,{"$f":"IFERROR(INDEX($A$19:$A$117, MATCH(0,IF(ISBLANK($A$19:$A$117),1,COUNTIF(E$401:$E457, $A$19:$A$117)), 0)),\"\")","v":""},0]
[null,null,null,0,{"$f":"IFERROR(INDEX($A$19:$A$117, MATCH(0,IF(ISBLANK($A$19:$A$117),1,COUNTIF(E$401:$E458, $A$19:$A$117)), 0)),\"\")","v":""},0]
[null,null,null,0,{"$f":"IFERROR(INDEX($A$19:$A$117, MATCH(0,IF(ISBLANK($A$19:$A$117),1,COUNTIF(E$401:$E459, $A$19:$A$117)), 0)),\"\")","v":""},0]
[null,null,null,0,{"$f":"IFERROR(INDEX($A$19:$A$117, MATCH(0,IF(ISBLANK($A$19:$A$117),1,COUNTIF(E$401:$E460, $A$19:$A$117)), 0)),\"\")","v":""},0]
[null,null,null,0,{"$f":"IFERROR(INDEX($A$19:$A$117, MATCH(0,IF(ISBLANK($A$19:$A$117),1,COUNTIF(E$401:$E461, $A$19:$A$117)), 0)),\"\")","v":""},0]
[null,null,null,0,{"$f":"IFERROR(INDEX($A$19:$A$117, MATCH(0,IF(ISBLANK($A$19:$A$117),1,COUNTIF(E$401:$E462, $A$19:$A$117)), 0)),\"\")","v":""},0]
[null,null,null,0,{"$f":"IFERROR(INDEX($A$19:$A$117, MATCH(0,IF(ISBLANK($A$19:$A$117),1,COUNTIF(E$401:$E463, $A$19:$A$117)), 0)),\"\")","v":""},0]
[null,null,null,0,{"$f":"IFERROR(INDEX($A$19:$A$117, MATCH(0,IF(ISBLANK($A$19:$A$117),1,COUNTIF(E$401:$E464, $A$19:$A$117)), 0)),\"\")","v":""},0]
[null,null,null,0,{"$f":"IFERROR(INDEX($A$19:$A$117, MATCH(0,IF(ISBLANK($A$19:$A$117),1,COUNTIF(E$401:$E465, $A$19:$A$117)), 0)),\"\")","v":""},{"$f":"SUMIF(A$19:A$117,E466,$Q$19:$Q$118)","v":0}]
[null,null,null,{"$f":"IF(E467=$C$182,0,99)","v":0},{"$f":"IFERROR(INDEX($A$19:$A$117, MATCH(0,IF(ISBLANK($A$19:$A$117),1,COUNTIF(E$401:$E466, $A$19:$A$117)), 0)),\"\")","v":""},0]
[null,null,null,0,{"$f":"IFERROR(INDEX($A$19:$A$117, MATCH(0,IF(ISBLANK($A$19:$A$117),1,COUNTIF(E$401:$E467, $A$19:$A$117)), 0)),\"\")","v":""},0]
[null,null,null,0,{"$f":"IFERROR(INDEX($A$19:$A$117, MATCH(0,IF(ISBLANK($A$19:$A$117),1,COUNTIF(E$401:$E468, $A$19:$A$117)), 0)),\"\")","v":""},0]
[null,null,null,0,{"$f":"IFERROR(INDEX($A$19:$A$117, MATCH(0,IF(ISBLANK($A$19:$A$117),1,COUNTIF(E$401:$E469, $A$19:$A$117)), 0)),\"\")","v":""},0]
[null,null,null,0,{"$f":"IFERROR(INDEX($A$19:$A$117, MATCH(0,IF(ISBLANK($A$19:$A$117),1,COUNTIF(E$401:$E470, $A$19:$A$117)), 0)),\"\")","v":""},0]
[null,null,null,0,{"$f":"IFERROR(INDEX($A$19:$A$117, MATCH(0,IF(ISBLANK($A$19:$A$117),1,COUNTIF(E$401:$E471, $A$19:$A$117)), 0)),\"\")","v":""},0]
[null,null,null,0,{"$f":"IFERROR(INDEX($A$19:$A$117, MATCH(0,IF(ISBLANK($A$19:$A$117),1,COUNTIF(E$401:$E472, $A$19:$A$117)), 0)),\"\")","v":""},0]
[null,null,null,0,{"$f":"IFERROR(INDEX($A$19:$A$117, MATCH(0,IF(ISBLANK($A$19:$A$117),1,COUNTIF(E$401:$E473, $A$19:$A$117)), 0)),\"\")","v":""},0]
[null,null,null,0,{"$f":"IFERROR(INDEX($A$19:$A$117, MATCH(0,IF(ISBLANK($A$19:$A$117),1,COUNTIF(E$401:$E474, $A$19:$A$117)), 0)),\"\")","v":""},0]
[null,null,null,0,{"$f":"IFERROR(INDEX($A$19:$A$117, MATCH(0,IF(ISBLANK($A$19:$A$117),1,COUNTIF(E$401:$E475, $A$19:$A$117)), 0)),\"\")","v":""},0]
[null,null,null,0,{"$f":"IFERROR(INDEX($A$19:$A$117, MATCH(0,IF(ISBLANK($A$19:$A$117),1,COUNTIF(E$401:$E476, $A$19:$A$117)), 0)),\"\")","v":""},0]
[null,null,null,0,{"$f":"IFERROR(INDEX($A$19:$A$117, MATCH(0,IF(ISBLANK($A$19:$A$117),1,COUNTIF(E$401:$E477, $A$19:$A$117)), 0)),\"\")","v":""},0]
[null,null,null,0,{"$f":"IFERROR(INDEX($A$19:$A$117, MATCH(0,IF(ISBLANK($A$19:$A$117),1,COUNTIF(E$401:$E478, $A$19:$A$117)), 0)),\"\")","v":""},0]
[null,null,null,0,{"$f":"IFERROR(INDEX($A$19:$A$117, MATCH(0,IF(ISBLANK($A$19:$A$117),1,COUNTIF(E$401:$E479, $A$19:$A$117)), 0)),\"\")","v":""},0]
[null,null,null,0,{"$f":"IFERROR(INDEX($A$19:$A$117, MATCH(0,IF(ISBLANK($A$19:$A$117),1,COUNTIF(E$401:$E480, $A$19:$A$117)), 0)),\"\")","v":""},0]
[null,null,null,0,{"$f":"IFERROR(INDEX($A$19:$A$117, MATCH(0,IF(ISBLANK($A$19:$A$117),1,COUNTIF(E$401:$E481, $A$19:$A$117)), 0)),\"\")","v":""},0]
[null,null,null,0,{"$f":"IFERROR(INDEX($A$19:$A$117, MATCH(0,IF(ISBLANK($A$19:$A$117),1,COUNTIF(E$401:$E482, $A$19:$A$117)), 0)),\"\")","v":""},0]
[null,null,null,0,{"$f":"IFERROR(INDEX($A$19:$A$117, MATCH(0,IF(ISBLANK($A$19:$A$117),1,COUNTIF(E$401:$E483, $A$19:$A$117)), 0)),\"\")","v":""},0]
[null,null,null,0,{"$f":"IFERROR(INDEX($A$19:$A$117, MATCH(0,IF(ISBLANK($A$19:$A$117),1,COUNTIF(E$401:$E484, $A$19:$A$117)), 0)),\"\")","v":""},0]
[null,null,null,0,{"$f":"IFERROR(INDEX($A$19:$A$117, MATCH(0,IF(ISBLANK($A$19:$A$117),1,COUNTIF(E$401:$E485, $A$19:$A$117)), 0)),\"\")","v":""},0]
[null,null,null,0,{"$f":"IFERROR(INDEX($A$19:$A$117, MATCH(0,IF(ISBLANK($A$19:$A$117),1,COUNTIF(E$401:$E486, $A$19:$A$117)), 0)),\"\")","v":""},0]
[null,null,null,0,{"$f":"IFERROR(INDEX($A$19:$A$117, MATCH(0,IF(ISBLANK($A$19:$A$117),1,COUNTIF(E$401:$E487, $A$19:$A$117)), 0)),\"\")","v":""},0]
[null,null,null,0,{"$f":"IFERROR(INDEX($A$19:$A$117, MATCH(0,IF(ISBLANK($A$19:$A$117),1,COUNTIF(E$401:$E488, $A$19:$A$117)), 0)),\"\")","v":""},0]
[null,null,null,0,{"$f":"IFERROR(INDEX($A$19:$A$117, MATCH(0,IF(ISBLANK($A$19:$A$117),1,COUNTIF(E$401:$E489, $A$19:$A$117)), 0)),\"\")","v":""},0]
[null,null,null,0,{"$f":"IFERROR(INDEX($A$19:$A$117, MATCH(0,IF(ISBLANK($A$19:$A$117),1,COUNTIF(E$401:$E490, $A$19:$A$117)), 0)),\"\")","v":""},0]
[null,null,null,0,{"$f":"IFERROR(INDEX($A$19:$A$117, MATCH(0,IF(ISBLANK($A$19:$A$117),1,COUNTIF(E$401:$E491, $A$19:$A$117)), 0)),\"\")","v":""},0]
[null,null,null,0,{"$f":"IFERROR(INDEX($A$19:$A$117, MATCH(0,IF(ISBLANK($A$19:$A$117),1,COUNTIF(E$401:$E492, $A$19:$A$117)), 0)),\"\")","v":""},0]
[null,null,null,0,{"$f":"IFERROR(INDEX($A$19:$A$117, MATCH(0,IF(ISBLANK($A$19:$A$117),1,COUNTIF(E$401:$E493, $A$19:$A$117)), 0)),\"\")","v":""},0]
[null,null,null,0,{"$f":"IFERROR(INDEX($A$19:$A$117, MATCH(0,IF(ISBLANK($A$19:$A$117),1,COUNTIF(E$401:$E494, $A$19:$A$117)), 0)),\"\")","v":""},0]
[null,null,null,0,{"$f":"IFERROR(INDEX($A$19:$A$117, MATCH(0,IF(ISBLANK($A$19:$A$117),1,COUNTIF(E$401:$E495, $A$19:$A$117)), 0)),\"\")","v":""},0]
[null,null,null,0,{"$f":"IFERROR(INDEX($A$19:$A$117, MATCH(0,IF(ISBLANK($A$19:$A$117),1,COUNTIF(E$401:$E496, $A$19:$A$117)), 0)),\"\")","v":""},0]
[null,null,null,0,{"$f":"IFERROR(INDEX($A$19:$A$117, MATCH(0,IF(ISBLANK($A$19:$A$117),1,COUNTIF(E$401:$E497, $A$19:$A$117)), 0)),\"\")","v":""},0]
[null,null,null,0,{"$f":"IFERROR(INDEX($A$19:$A$117, MATCH(0,IF(ISBLANK($A$19:$A$117),1,COUNTIF(E$401:$E498, $A$19:$A$117)), 0)),\"\")","v":""},0]
[null,null,null,0,{"$f":"IFERROR(INDEX($A$19:$A$117, MATCH(0,IF(ISBLANK($A$19:$A$117),1,COUNTIF(E$401:$E499, $A$19:$A$117)), 0)),\"\")","v":""},0]
[null,null,null,500]

{"sheet":"1_tes1","index":3,"n_rows":165,"n_cols":21,"rows_kept":165,"cut":false,"hidden":false,"merged":[[163,4,163,15],[155,4,155,15],[155,17,156,18],[155,19,156,19],[156,4,156,15],[160,2,160,3],[162,4,162,15],[152,17,152,18],[152,20,152,35],[153,2,153,3],[153,17,153,18],[153,20,153,35],[154,17,154,18],[154,20,154,35],[149,4,149,15],[149,17,149,18],[149,20,149,35],[150,5,151,15],[150,17,150,18],[150,20,150,35],[151,17,151,18],[151,20,151,35],[147,4,147,15],[147,17,147,18],[147,20,147,35],[148,4,148,15],[148,17,148,18],[148,20,148,35],[145,4,145,15],[145,17,145,18],[145,20,145,35],[146,4,146,15],[146,17,146,18],[146,20,146,35],[118,12,119,12],[120,1,139,1],[142,17,142,18],[143,2,143,3],[143,17,143,25],[144,20,144,35],[5,7,6,11],[17,2,20,3],[118,2,119,2],[118,3,119,3],[118,4,118,9],[118,10,119,10],[118,11,119,11],[3,19,7,19],[4,5,7,5],[4,6,7,6],[4,7,4,9],[4,10,4,11],[4,12,7,12],[4,13,7,13],[4,14,7,14],[1,5,2,11],[1,12,1,20],[2,12,2,16],[2,18,2,19],[2,20,7,20],[3,2,4,3],[3,5,3,11],[3,12,3,16],[3,17,7,17],[3,18,7,18],[4,15,7,15],[4,16,7,16]]}
[{"$f":"Configuration!K15","v":"Participant"}]
[{"$f":"Configuration!G11","v":36},null,null,null,null,"Estimated expenditure",null,null,null,null,null,null,"Estimated Income"]
["J",null,null,null,null,null,null,null,null,null,null,null,"Requested EU contibution",null,null,null,null,"Revenues","Other cources of fincancing",null,"Total estimated income"]
["L",null,"Associated Partners can't request funding from HEU",null,null,"Estimated eligible costs",null,null,null,null,null,null,"EU contribution to eligible costs",null,null,null,null,"Income generated by the action","Financial contributions","Own resources"]
["M",null,null,null,null,"Personnel costs/€","Subcontracting costs/€","Purchase costs",null,null,"Other cost categories",null,"Indirect costs(€","Total eliqble costs","Funding rate","Maximun EU contribution to eliquble costs/€ (requested grant amount)","Requested EU contribution to eliqble costs/€ (requested grant amount)"]
[null,null,null,null,null,null,null,"Purchase costs"]
[]
[null,null,"No","Participant name","Country",null,null,"Travel and subsistence/€","Equipment/€","Other goods, works and services/€","Internal invoicing for goods and services","Finanical support to 3rd parties"]
[null,null,{"$f":"Configuration!F15","v":1},{"$f":"Configuration!H15","v":"tes1"},{"$f":"Configuration!I15","v":2},{"$f":"M141","v":800},{"$f":"D165","v":0},{"$f":"D146","v":90000},{"$f":"D147","v":0},{"$f":"D150+D148+D149","v":0},{"$f":"D156","v":0},{"$f":"D157","v":0},{"$f":"0.25*(F9+H9+I9+J9)","v":22700},{"$f":"F9+G9+H9+I9+J9+K9+M9","v":113500},1,{"$f":"O9*N9","v":113500},null,null,null,null,{"$f":"Q9+R9+S9+T9","v":0}]
[]
[null,null,null,null,null,null,null,null,null,null,null,null,null,null,"Remember to  update the following fields"]
[null,null,null,null,null,null,null,null,null,null,null,null,null,null,"* Funding rate"]
[null,null,null,null,null,null,null,null,null,null,null,null,null,null,"* Requested EU contribution"]
[null,null,null,null,null,null,null,null,null,null,null,null,null,null,"* Income Generated by the action"]
[null,null,null,null,null,null,null,null,null,null,null,null,null,null,"* Own resources"]
[]
[]
[null,null,"Personnel costs/€"]
[]
[]
[]
[]
[]
[]
[]
[]
[]
[]
[]
[]
[]
[]
[]
[]
[]
[]
[]
[]
[]
[]
[]
[]
[]
[]
[]
[]
[]
[]
[]
[]
[]
[]
[]
[]
[]
[]
[]
[]
[]
[]
[]
[]
[]
[]
[]
[]
[]
[]
[]
[]
[]
[]
[]
[]
[]
[]
[]
[]
[]
[]
[]
[]
[]
[]
[]
[]
[]
[]
[]
[]
[]
[]
[]
[]
[]
[]
[]
[]
[]
[]
[]
[]
[]
[]
[]
[]
[]
[]
[]
[]
[]
[]
[]
[]
[]
[]
[]
[]
[null,null,"Type pf Personnel","Direct cost /month (€)","Work Packages",null,null,null,null,null,"No of Person-months","Activity in project (%)","Total Cost (€)"]
[null,null,null,null,"WP 1","WP 2","WP 3","WP 4","WP 5","WP 6"]
[null,"Please change these example \"Type of personnel\"","Person 1 - PhD",null,null,null,null,null,null,null,{"$f":"SUM(E121:J121)","v":0},{"$f":"SUM(E121:J121)/$A$2","v":0},{"$f":"D121*K121","v":0}]
[null,null,"Person 2 - PhD",100,1,2,null,5,null,null,8,0.22222222222222221,800]
[null,null,"Person 3 - PostDoc",null,null,null,null,null,null,null,0,0,0]
[null,null,"Person 4 - Researcher",null,null,null,null,null,null,null,0,0,0]
[null,null,"Person 5 - Professor",null,null,null,null,null,null,null,0,0,0]
[null,null,"Person 6 - Admin ",null,null,null,null,null,null,null,0,0,0]
[null,null,"Person 7- 2nd personell from 3rd party",null,null,null,null,null,null,null,0,0,0]
[null,null,null,null,null,null,null,null,null,null,0,0,0]
[null,null,null,null,null,null,null,null,null,null,0,0,0]
[null,null,null,null,null,null,null,null,null,null,0,0,0]
[null,null,null,null,null,null,null,null,null,null,0,0,0]
[null,null,null,null,null,null,null,null,null,null,0,0,0]
[null,null,null,null,null,null,null,null,null,null,0,0,0]
[null,null,null,null,null,null,null,null,null,null,0,0,0]
[null,null,null,null,null,null,null,null,null,null,0,0,0]
[null,null,null,null,null,null,null,null,null,null,0,0,0]
[null,null,null,null,null,null,null,null,null,null,0,0,0]
[null,null,null,null,null,null,null,null,null,null,0,0,0]
[null,null,null,null,null,null,null,null,null,null,0,0,0]
[null,null,null,null,null,null,null,null,null,null,0,0,0]
[null,null,"Total Personnel Costs",{"$f":"SUM(D121:D140)","v":100},1,2,0,5,0,0,8,0.22222222222222221,800]
[]
[null,null,null,null,null,null,null,null,null,null,null,null,null,null,null,null,null,"Table 3.1 justification"]
[null,null,"Other direct  costs  (in €)    ",null,null,null,null,null,null,null,null,null,null,null,null,null,null,"List the the costs starting with the largest intil the remaining costs are below 15% of personel costs"]
[null,null,null,null,null,null,null,null,null,null,null,null,null,null,null,null,null,null,null,"Cost","Justification"]
[null,null,"Travel ",90000,"Describe the costs",null,null,null,null,null,null,null,null,null,null,null,null,1,null,1500,454]
[null,null,"Equipment",null,"Describe the costs",null,null,null,null,null,null,null,null,null,null,null,null,2,null,50000,22]
[null,null,"Consumables",null,"Describe the costs",null,null,null,null,null,null,null,null,null,null,null,null,3,null,555555555,555]
[null,null,"Publications",null,"Describe the costs",null,null,null,null,null,null,null,null,null,null,null,null,4]
[null,null,"Other goods and services (incl audit)",null,"Describe the costs",null,null,null,null,null,null,null,null,null,null,null,null,5]
[null,null,"Total Other direct costs ",{"$f":"SUM(D146:D150)","v":90000},{"$f":"IF($M$141>0,(SUM($D$146:$D$150)/$M$141),0)","v":112.5},"If the cost of other direct costs excede 15% of the total personnel costs this will need justification in part B of the proposal (table 3.1h)",null,null,null,null,null,null,null,null,null,null,null,6]
[null,null,null,null,null,null,null,null,null,null,null,null,null,null,null,null,null,7]
[null,null,null,null,null,null,null,null,null,null,null,null,null,null,null,null,null,8]
[null,null,"Other cost categories (in €)    ",null,null,null,null,null,null,null,null,null,null,null,null,null,null,9]
[null,null,null,null,null,null,null,null,null,null,null,null,null,null,null,null,null,10]
[null,null,"Internal invoicing for goods and services",null,"Describe the costs",null,null,null,null,null,null,null,null,null,null,null,null,"Remaining % total other direct costs",null,{"$f":"(D151-SUM(T146:T151))/M141","v":-694396.31874999998}]
[null,null,"Finanical support to 3rd parties",null,"Describe the costs"]
[null,null,"Total ",{"$f":"SUM(D156:D157)","v":0}]
[]
[]
[null,null,"Direct costs of subcontracting (in €)    "]
[]
[null,null,"Subcontractor1",null,"Describe the costs"]
[null,null,"Subcontractor2",null,"Describe the costs"]
[null,null,"Total ",{"$f":"SUM(D163:D164)","v":0}]

{"sheet":"2_2","index":4,"n_rows":165,"n_cols":21,"rows_kept":165,"cut":false,"hidden":false,"merged":[[163,4,163,15],[155,4,155,15],[155,17,156,18],[155,19,156,19],[156,4,156,15],[160,2,160,3],[162,4,162,15],[152,17,152,18],[152,20,152,35],[153,2,153,3],[153,17,153,18],[153,20,153,35],[154,17,154,18],[154,20,154,35],[149,4,149,15],[149,17,149,18],[149,20,149,35],[150,5,151,15],[150,17,150,18],[150,20,150,35],[151,17,151,18],[151,20,151,35],[147,4,147,15],[147,17,147,18],[147,20,147,35],[148,4,148,15],[148,17,148,18],[148,20,148,35],[145,4,145,15],[145,17,145,18],[145,20,145,35],[146,4,146,15],[146,17,146,18],[146,20,146,35],[118,12,119,12],[120,1,139,1],[142,17,142,18],[143,2,143,3],[143,17,143,25],[144,20,144,35],[5,7,6,11],[17,2,20,3],[118,2,119,2],[118,3,119,3],[118,4,118,9],[118,10,119,10],[118,11,119,11],[3,19,7,19],[4,5,7,5],[4,6,7,6],[4,7,4,9],[4,10,4,11],[4,12,7,12],[4,13,7,13],[4,14,7,14],[1,5,2,11],[1,12,1,20],[2,12,2,16],[2,18,2,19],[2,20,7,20],[3,2,4,3],[3,5,3,11],[3,12,3,16],[3,17,7,17],[3,18,7,18],[4,15,7,15],[4,16,7,16]]}
[{"$f":"Configuration!K16","v":"Participant"}]
[{"$f":"Configuration!G11","v":36},null,null,null,null,"Estimated expenditure",null,null,null,null,null,null,"Estimated Income"]
["J",null,null,null,null,null,null,null,null,null,null,null,"Requested EU contibution",null,null,null,null,"Revenues","Other cources of fincancing",null,"Total estimated income"]
["L",null,"Associated Partners can't request funding from HEU",null,null,"Estimated eligible costs",null,null,null,null,null,null,"EU contribution to eligible costs",null,null,null,null,"Income generated by the action","Financial contributions","Own resources"]
["M",null,null,null,null,"Personnel costs/€","Subcontracting costs/€","Purchase costs",null,null,"Other cost categories",null,"Indirect costs(€","Total eliqble costs","Funding rate","Maximun EU contribution to eliquble costs/€ (requested grant amount)","Requested EU contribution to eliqble costs/€ (requested grant amount)"]
[null,null,null,null,null,null,null,"Purchase costs"]
[]
[null,null,"No","Participant name","Country",null,null,"Travel and subsistence/€","Equipment/€","Other goods, works and services/€","Internal invoicing for goods and services","Finanical support to 3rd parties"]
[null,null,{"$f":"Configuration!F16","v":2},{"$f":"Configuration!H16","v":2},{"$f":"Configuration!I16","v":3},{"$f":"M141","v":0},{"$f":"D165","v":0},{"$f":"D146","v":0},{"$f":"D147","v":0},{"$f":"D150+D148+D149","v":0},{"$f":"D156","v":0},{"$f":"D157","v":0},{"$f":"0.25*(F9+H9+I9+J9)","v":0},{"$f":"F9+G9+H9+I9+J9+K9+M9","v":0},1,{"$f":"O9*N9","v":0},null,null,null,null,{"$f":"Q9+R9+S9+T9","v":0}]
[]
[null,null,null,null,null,null,null,null,null,null,null,null,null,null,"Remember to  update the following fields"]
[null,null,null,null,null,null,null,null,null,null,null,null,null,null,"* Funding rate"]
[null,null,null,null,null,null,null,null,null,null,null,null,null,null,"* Requested EU contribution"]
[null,null,null,null,null,null,null,null,null,null,null,null,null,null,"* Income Generated by the action"]
[null,null,null,null,null,null,null,null,null,null,null,null,null,null,"* Own resources"]
[]
[]
[null,null,"Personnel costs/€"]
[]
[]
[]
[]
[]
[]
[]
[]
[]
[]
[]
[]
[]
[]
[]
[]
[]
[]
[]
[]
[]
[]
[]
[]
[]
[]
[]
[]
[]
[]
[]
[]
[]
[]
[]
[]
[]
[]
[]
[]
[]
[]
[]
[]
[]
[]
[]
[]
[]
[]
[]
[]
[]
[]
[]
[]
[]
[]
[]
[]
[]
[]
[]
[]
[]
[]
[]
[]
[]
[]
[]
[]
[]
[]
[]
[]
[]
[]
[]
[]
[]
[]
[]
[]
[]
[]
[]
[]
[]
[]
[]
[]
[]
[]
[]
[]
[]
[]
[]
[]
[null,null,"Type pf Personnel","Direct cost /month (€)","Work Packages",null,null,null,null,null,"No of Person-months","Activity in project (%)","Total Cost (€)"]
[null,null,null,null,"WP 1","WP 2","WP 3","WP 4","WP 5","WP 6"]
[null,"Please change these example \"Type of personnel\"","Person 1 - PhD",null,null,null,null,null,null,null,{"$f":"SUM(E121:J121)","v":0},{"$f":"SUM(E121:J121)/$A$2","v":0},{"$f":"D121*K121","v":0}]
[null,null,"Person 2 - PhD",null,null,null,null,null,null,null,0,0,0]
[null,null,"Person 3 - PostDoc",null,null,null,null,null,null,null,0,0,0]
[null,null,"Person 4 - Researcher",null,null,null,null,null,null,null,0,0,0]
[null,null,"Person 5 - Professor",null,null,null,null,null,null,null,0,0,0]
[null,null,"Person 6 - Admin ",null,null,null,null,null,null,null,0,0,0]
[null,null,"Person 7- 2nd personell from 3rd party",null,null,null,null,null,null,null,0,0,0]
[null,null,null,null,null,null,null,null,null,null,0,0,0]
[null,null,null,null,null,null,null,null,null,null,0,0,0]
[null,null,null,null,null,null,null,null,null,null,0,0,0]
[null,null,null,null,null,null,null,null,null,null,0,0,0]
[null,null,null,null,null,null,null,null,null,null,0,0,0]
[null,null,null,null,null,null,null,null,null,null,0,0,0]
[null,null,null,null,null,null,null,null,null,null,0,0,0]
[null,null,null,null,null,null,null,null,null,null,0,0,0]
[null,null,null,null,null,null,null,null,null,null,0,0,0]
[null,null,null,null,null,null,null,null,null,null,0,0,0]
[null,null,null,null,null,null,null,null,null,null,0,0,0]
[null,null,null,null,null,null,null,null,null,null,0,0,0]
[null,null,null,null,null,null,null,null,null,null,0,0,0]
[null,null,"Total Personnel Costs",{"$f":"SUM(D121:D140)","v":0},0,0,0,0,0,0,0,0,0]
[]
[null,null,null,null,null,null,null,null,null,null,null,null,null,null,null,null,null,"Table 3.1 justification"]
[null,null,"Other direct  costs  (in €)    ",null,null,null,null,null,null,null,null,null,null,null,null,null,null,"List the the costs starting with the largest intil the remaining costs are below 15% of personel costs"]
[null,null,null,null,null,null,null,null,null,null,null,null,null,null,null,null,null,null,null,"Cost","Justification"]
[null,null,"Travel ",null,"Describe the costs",null,null,null,null,null,null,null,null,null,null,null,null,1]
[null,null,"Equipment",null,"Describe the costs",null,null,null,null,null,null,null,null,null,null,null,null,2]
[null,null,"Consumables",null,"Describe the costs",null,null,null,null,null,null,null,null,null,null,null,null,3]
[null,null,"Publications",null,"Describe the costs",null,null,null,null,null,null,null,null,null,null,null,null,4]
[null,null,"Other goods and services (incl audit)",null,"Describe the costs",null,null,null,null,null,null,null,null,null,null,null,null,5]
[null,null,"Total Other direct costs ",{"$f":"SUM(D146:D150)","v":0},{"$f":"IF($M$141>0,(SUM($D$146:$D$150)/$M$141),0)","v":0},"If the cost of other direct costs excede 15% of the total personnel costs this will need justification in part B of the proposal (table 3.1h)",null,null,null,null,null,null,null,null,null,null,null,6]
[null,null,null,null,null,null,null,null,null,null,null,null,null,null,null,null,null,7]
[null,null,null,null,null,null,null,null,null,null,null,null,null,null,null,null,null,8]
[null,null,"Other cost categories (in €)    ",null,null,null,null,null,null,null,null,null,null,null,null,null,null,9]
[null,null,null,null,null,null,null,null,null,null,null,null,null,null,null,null,null,10]
[null,null,"Internal invoicing for goods and services",null,"Describe the costs",null,null,null,null,null,null,null,null,null,null,null,null,"Remaining % total other direct costs",null,{"$f":"(D151-SUM(T146:T151))/M141","v":{"$error":"#DIV/0!"}}]
[null,null,"Finanical support to 3rd parties",null,"Describe the costs"]
[null,null,"Total ",{"$f":"SUM(D156:D157)","v":0}]
[]
[]
[null,null,"Direct costs of subcontracting (in €)    "]
[]
[null,null,"Subcontractor1",null,"Describe the costs"]
[null,null,"Subcontractor2",null,"Describe the costs"]
[null,null,"Total ",{"$f":"SUM(D163:D164)","v":0}]

{"sheet":"3_3","index":5,"n_rows":165,"n_cols":21,"rows_kept":165,"cut":false,"hidden":false,"merged":[[3,2,4,3],[3,5,3,11],[3,12,3,16],[3,17,7,17],[3,18,7,18],[4,15,7,15],[4,16,7,16],[1,5,2,11],[1,12,1,20],[2,12,2,16],[2,18,2,19],[2,20,7,20],[144,20,144,35],[5,7,6,11],[17,2,20,3],[118,2,119,2],[118,3,119,3],[118,4,118,9],[118,10,119,10],[118,11,119,11],[3,19,7,19],[4,5,7,5],[4,6,7,6],[4,7,4,9],[4,10,4,11],[4,12,7,12],[4,13,7,13],[4,14,7,14],[118,12,119,12],[120,1,139,1],[142,17,142,18],[143,2,143,3],[143,17,143,25],[145,4,145,15],[145,17,145,18],[145,20,145,35],[146,4,146,15],[146,17,146,18],[146,20,146,35],[147,4,147,15],[147,17,147,18],[147,20,147,35],[148,4,148,15],[148,17,148,18],[148,20,148,35],[149,4,149,15],[149,17,149,18],[149,20,149,35],[150,5,151,15],[150,17,150,18],[150,20,150,35],[151,17,151,18],[151,20,151,35],[160,2,160,3],[162,4,162,15],[152,17,152,18],[152,20,152,35],[153,2,153,3],[153,17,153,18],[153,20,153,35],[154,17,154,18],[154,20,154,35],[163,4,163,15],[155,4,155,15],[155,17,156,18],[155,19,156,19],[156,4,156,15]]}
[{"$f":"Configuration!K17","v":"Participant"}]
[{"$f":"Configuration!G11","v":36},null,null,null,null,"Estimated expenditure",null,null,null,null,null,null,"Estimated Income"]
["J",null,null,null,null,null,null,null,null,null,null,null,"Requested EU contibution",null,null,null,null,"Revenues","Other cources of fincancing",null,"Total estimated income"]
["L",null,"Associated Partners can't request funding from HEU",null,null,"Estimated eligible costs",null,null,null,null,null,null,"EU contribution to eligible costs",null,null,null,null,"Income generated by the action","Financial contributions","Own resources"]
["M",null,null,null,null,"Personnel costs/€","Subcontracting costs/€","Purchase costs",null,null,"Other cost categories",null,"Indirect costs(€","Total eliqble costs","Funding rate","Maximun EU contribution to eliquble costs/€ (requested grant amount)","Requested EU contribution to eliqble costs/€ (requested grant amount)"]
[null,null,null,null,null,null,null,"Purchase costs"]
[]
[null,null,"No","Participant name","Country",null,null,"Travel and subsistence/€","Equipment/€","Other goods, works and services/€","Internal invoicing for goods and services","Finanical support to 3rd parties"]
[null,null,{"$f":"Configuration!F17","v":3},{"$f":"Configuration!H17","v":3},{"$f":"Configuration!I17","v":3},{"$f":"M141","v":0},{"$f":"D165","v":0},{"$f":"D146","v":0},{"$f":"D147","v":0},{"$f":"D150+D148+D149","v":0},{"$f":"D156","v":0},{"$f":"D157","v":0},{"$f":"0.25*(F9+H9+I9+J9)","v":0},{"$f":"F9+G9+H9+I9+J9+K9+M9","v":0},1,{"$f":"O9*N9","v":0},null,null,null,null,{"$f":"Q9+R9+S9+T9","v":0}]
[]
[null,null,null,null,null,null,null,null,null,null,null,null,null,null,"Remember to  update the following fields"]
[null,null,null,null,null,null,null,null,null,null,null,null,null,null,"* Funding rate"]
[null,null,null,null,null,null,null,null,null,null,null,null,null,null,"* Requested EU contribution"]
[null,null,null,null,null,null,null,null,null,null,null,null,null,null,"* Income Generated by the action"]
[null,null,null,null,null,null,null,null,null,null,null,null,null,null,"* Own resources"]
[]
[]
[null,null,"Personnel costs/€"]
[]
[]
[]
[]
[]
[]
[]
[]
[]
[]
[]
[]
[]
[]
[]
[]
[]
[]
[]
[]
[]
[]
[]
[]
[]
[]
[]
[]
[]
[]
[]
[]
[]
[]
[]
[]
[]
[]
[]
[]
[]
[]
[]
[]
[]
[]
[]
[]
[]
[]
[]
[]
[]
[]
[]
[]
[]
[]
[]
[]
[]
[]
[]
[]
[]
[]
[]
[]
[]
[]
[]
[]
[]
[]
[]
[]
[]
[]
[]
[]
[]
[]
[]
[]
[]
[]
[]
[]
[]
[]
[]
[]
[]
[]
[]
[]
[]
[]
[]
[]
[null,null,"Type pf Personnel","Direct cost /month (€)","Work Packages",null,null,null,null,null,"No of Person-months","Activity in project (%)","Total Cost (€)"]
[null,null,null,null,"WP 1","WP 2","WP 3","WP 4","WP 5","WP 6"]
[null,"Please change these example \"Type of personnel\"","Person 1 - PhD",null,null,null,null,null,null,null,{"$f":"SUM(E121:J121)","v":0},{"$f":"SUM(E121:J121)/$A$2","v":0},{"$f":"D121*K121","v":0}]
[null,null,"Person 2 - PhD",null,null,null,null,null,null,null,{"$f":"SUM(E122:J122)","v":0},{"$f":"SUM(E122:J122)/$A$2","v":0},{"$f":"D122*K122","v":0}]
[null,null,"Person 3 - PostDoc",null,null,null,null,null,null,null,{"$f":"SUM(E123:J123)","v":0},{"$f":"SUM(E123:J123)/$A$2","v":0},{"$f":"D123*K123","v":0}]
[null,null,"Person 4 - Researcher",null,null,null,null,null,null,null,{"$f":"SUM(E124:J124)","v":0},{"$f":"SUM(E124:J124)/$A$2","v":0},{"$f":"D124*K124","v":0}]
[null,null,"Person 5 - Professor",null,null,null,null,null,null,null,{"$f":"SUM(E125:J125)","v":0},{"$f":"SUM(E125:J125)/$A$2","v":0},{"$f":"D125*K125","v":0}]
[null,null,"Person 6 - Admin ",null,null,null,null,null,null,null,{"$f":"SUM(E126:J126)","v":0},{"$f":"SUM(E126:J126)/$A$2","v":0},{"$f":"D126*K126","v":0}]
[null,null,"Person 7- 2nd personell from 3rd party",null,null,null,null,null,null,null,{"$f":"SUM(E127:J127)","v":0},{"$f":"SUM(E127:J127)/$A$2","v":0},{"$f":"D127*K127","v":0}]
[null,null,null,null,null,null,null,null,null,null,{"$f":"SUM(E128:J128)","v":0},{"$f":"SUM(E128:J128)/$A$2","v":0},{"$f":"D128*K128","v":0}]
[null,null,null,null,null,null,null,null,null,null,{"$f":"SUM(E129:J129)","v":0},{"$f":"SUM(E129:J129)/$A$2","v":0},{"$f":"D129*K129","v":0}]
[null,null,null,null,null,null,null,null,null,null,{"$f":"SUM(E130:J130)","v":0},{"$f":"SUM(E130:J130)/$A$2","v":0},{"$f":"D130*K130","v":0}]
[null,null,null,null,null,null,null,null,null,null,{"$f":"SUM(E131:J131)","v":0},{"$f":"SUM(E131:J131)/$A$2","v":0},{"$f":"D131*K131","v":0}]
[null,null,null,null,null,null,null,null,null,null,{"$f":"SUM(E132:J132)","v":0},{"$f":"SUM(E132:J132)/$A$2","v":0},{"$f":"D132*K132","v":0}]
[null,null,null,null,null,null,null,null,null,null,{"$f":"SUM(E133:J133)","v":0},{"$f":"SUM(E133:J133)/$A$2","v":0},{"$f":"D133*K133","v":0}]
[null,null,null,null,null,null,null,null,null,null,{"$f":"SUM(E134:J134)","v":0},{"$f":"SUM(E134:J134)/$A$2","v":0},{"$f":"D134*K134","v":0}]
[null,null,null,null,null,null,null,null,null,null,{"$f":"SUM(E135:J135)","v":0},{"$f":"SUM(E135:J135)/$A$2","v":0},{"$f":"D135*K135","v":0}]
[null,null,null,null,null,null,null,null,null,null,{"$f":"SUM(E136:J136)","v":0},{"$f":"SUM(E136:J136)/$A$2","v":0},{"$f":"D136*K136","v":0}]
[null,null,null,null,null,null,null,null,null,null,{"$f":"SUM(E137:J137)","v":0},{"$f":"SUM(E137:J137)/$A$2","v":0},{"$f":"D137*K137","v":0}]
[null,null,null,null,null,null,null,null,null,null,{"$f":"SUM(E138:J138)","v":0},{"$f":"SUM(E138:J138)/$A$2","v":0},{"$f":"D138*K138","v":0}]
[null,null,null,null,null,null,null,null,null,null,{"$f":"SUM(E139:J139)","v":0},{"$f":"SUM(E139:J139)/$A$2","v":0},{"$f":"D139*K139","v":0}]
[null,null,null,null,null,null,null,null,null,null,{"$f":"SUM(E140:J140)","v":0},{"$f":"SUM(E140:J140)/$A$2","v":0},{"$f":"D140*K140","v":0}]
[null,null,"Total Personnel Costs",{"$f":"SUM(D121:D140)","v":0},{"$f":"SUM(E121:E140)","v":0},{"$f":"SUM(F121:F140)","v":0},{"$f":"SUM(G121:G140)","v":0},{"$f":"SUM(H121:H140)","v":0},{"$f":"SUM(I121:I140)","v":0},{"$f":"SUM(J121:J140)","v":0},{"$f":"SUM(K121:K140)","v":0},{"$f":"SUM(L121:L140)","v":0},{"$f":"SUM(M121:M140)","v":0}]
[]
[null,null,null,null,null,null,null,null,null,null,null,null,null,null,null,null,null,"Table 3.1 justification"]
[null,null,"Other direct  costs  (in €)    ",null,null,null,null,null,null,null,null,null,null,null,null,null,null,"List the the costs starting with the largest intil the remaining costs are below 15% of personel costs"]
[null,null,null,null,null,null,null,null,null,null,null,null,null,null,null,null,null,null,null,"Cost","Justification"]
[null,null,"Travel ",null,"Describe the costs",null,null,null,null,null,null,null,null,null,null,null,null,1]
[null,null,"Equipment",null,"Describe the costs",null,null,null,null,null,null,null,null,null,null,null,null,2]
[null,null,"Consumables",null,"Describe the costs",null,null,null,null,null,null,null,null,null,null,null,null,3]
[null,null,"Publications",null,"Describe the costs",null,null,null,null,null,null,null,null,null,null,null,null,4]
[null,null,"Other goods and services (incl audit)",null,"Describe the costs",null,null,null,null,null,null,null,null,null,null,null,null,5]
[null,null,"Total Other direct costs ",{"$f":"SUM(D146:D150)","v":0},{"$f":"IF($M$141>0,(SUM($D$146:$D$150)/$M$141),0)","v":0},"If the cost of other direct costs excede 15% of the total personnel costs this will need justification in part B of the proposal (table 3.1h)",null,null,null,null,null,null,null,null,null,null,null,6]
[null,null,null,null,null,null,null,null,null,null,null,null,null,null,null,null,null,7]
[null,null,null,null,null,null,null,null,null,null,null,null,null,null,null,null,null,8]
[null,null,"Other cost categories (in €)    ",null,null,null,null,null,null,null,null,null,null,null,null,null,null,9]
[null,null,null,null,null,null,null,null,null,null,null,null,null,null,null,null,null,10]
[null,null,"Internal invoicing for goods and services",null,"Describe the costs",null,null,null,null,null,null,null,null,null,null,null,null,"Remaining % total other direct costs",null,{"$f":"(D151-SUM(T146:T151))/M141","v":{"$error":"#DIV/0!"}}]
[null,null,"Finanical support to 3rd parties",null,"Describe the costs"]
[null,null,"Total ",{"$f":"SUM(D156:D157)","v":0}]
[]
[]
[null,null,"Direct costs of subcontracting (in €)    "]
[]
[null,null,"Subcontractor1",null,"Describe the costs"]
[null,null,"Subcontractor2",null,"Describe the costs"]
[null,null,"Total ",{"$f":"SUM(D163:D164)","v":0}]