{"text_format":"1","workbook":"xlsx","n_sheets":6,"sheets":["Configuration","Mall","Overview","1_tes1","2_2","3_3"],"not_rendered":{"charts":6,"images":1,"macros":1,"external_links":0,"defined_names":4,"comments":0,"pivot_tables":0},"unopened":[],"bounds":{"document_bytes":16777216,"sheet_cells":100000,"rows_first":2000,"rows_last":500,"rows_between":2000,"halvings":0,"cell_chars":16384,"cell_head_chars":4096},"cells_cut":0,"cells_raw":0,"read":"whole","date_system":"1900"}

{"sheet":"Configuration","index":0,"n_rows":385,"n_cols":23,"rows_kept":385,"cut":false,"hidden":false,"merged":[]}
[{"$f":"2+G8","v":5},6,{"$f":"B1-3","v":3},{"$f":"4+G8","v":7},null,null,"Instructions ",null,null,null,null,null,null,null,null,null,null,"Configuration",null,null,"previous partners",3]
["Tomruta",3,{"$f":"IF(B2<$A$1,\"Show\",\"Hide\")","v":"Show"},null,null,null,"1. Insert the number of partners/affiliated entities and associated partners, project duration and number of WPs",null,null,null,null,null,null,null,null,null,null,"Mall",null,null,"previous WPs",6]
[{"$f":"L15","v":"1_tes1"},2,{"$f":"IF(B3<$A$1,\"Show\",\"Hide\")","v":"Show"},null,null,null,"2. Fill in the table below with partner name/country/organisation and type of applicant",null,null,null,null,null,null,null,null,null,null,"Overview"]
[{"$f":"L16","v":"2_2"},null,null,null,null,null,"3. Press \"Refresh\"  to create or delete sheets based on number of partners and the table below",null,null,null,null,null,null,null,null,null,null,{"$f":"A3","v":"1_tes1"}]
[{"$f":"L17","v":"3_3"},null,null,null,null,null,"4. When all sheets are created, resave this file as \".xlsx \" to get a macro free version to use/send to partners",null,null,null,null,null,null,null,null,null,null,{"$f":"A4","v":"2_2"}]
[4,3,{"$f":"IF(B6<$A$1,\"Show\",\"Hide\")","v":"Show"},null,null,null,null,null,null,null,null,null,null,null,null,null,null,"3_3",null,null,null,null,"Participant"]
[5,4,{"$f":"IF(B7<$A$1,\"Show\",\"Hide\")","v":"Show"},null,null,null,"Number of Partners",null,null,null,null,null,null,null,null,null,null,4,null,null,null,null,"Affiliated Entity"]
[6,5,"Hide",null,null,null,3,null,null,null,null,null,null,null,null,null,null,5,null,null,null,null,"Associated Partner"]
[7,6,1,null,null,null,null,null,null,null,null,null,null,null,null,null,null,6]
[8,7,"Hide",null,null,null,"Project duration",null,"Number of WorkPackages",null,null,null,null,null,null,null,null,7]
[9,8,"Hide",null,null,null,36,"Months",6,null,null,null,null,null,null,null,null,8]
[10,9,"Hide",null,null,null,null,null,null,null,null,null,null,null,null,null,null,9]
[11,10,"Hide",null,null,null,null,null,null,null,null,null,null,null,null,null,null,10]
[12,11,"Hide",null,null,null,"Number","Name ","Country ","Organisation type","Type of applicant","Name of partners",null,null,null,null,null,11]
[13,12,"Hide",99,1,1,{"$f":"IF(G$8+0.5>F15,F15,\"\")","v":1},"tes1",2,4,"Participant",{"$f":"IF(K15=\"Participant\",E15&\"_\"&LEFT(RemoveSpecChar(H15),20),IF(LEFT(RemoveSpecChar(H15),20)=$F$1,F15,LEFT(RemoveSpecChar(H15),20)))","v":"1_tes1"},{"$f":"IF(F15<$G$8+1,\"Show\",\"Hide\")","v":"Show"},null,null,null,null,12]
[14,13,"Hide",99,2,2,2,2,3,5,"Participant",{"$f":"IF(K16=\"Participant\",E16&\"_\"&LEFT(RemoveSpecChar(H16),20),IF(LEFT(RemoveSpecChar(H16),20)=$F$1,F16,LEFT(RemoveSpecChar(H16),20)))","v":"2_2"},"Show",null,null,null,null,13]
[15,14,"Hide",99,3,3,3,3,3,3,"Participant",{"$f":"IF(K17=\"Participant\",E17&\"_\"&LEFT(RemoveSpecChar(H17),20),IF(LEFT(RemoveSpecChar(H17),20)=$F$1,F17,LEFT(RemoveSpecChar(H17),20)))","v":"3_3"},"Show",null,null,null,null,14]
[16,15,"Hide",99,4,4,"",null,null,null,null,{"$f":"IF(K18=\"Participant\",E18&\"_\"&LEFT(RemoveSpecChar(H18),20),IF(LEFT(RemoveSpecChar(H18),20)=$F$1,F18,LEFT(RemoveSpecChar(H18),20)))","v":4},"Hide",null,null,null,null,15]
[17,16,"Hide",99,5,5,{"$f":"IF(G$8+0.5>F19,F19,\"\")","v":""},null,null,null,null,{"$f":"IF(K19=\"Participant\",E19&\"_\"&LEFT(RemoveSpecChar(H19),20),IF(LEFT(RemoveSpecChar(H19),20)=$F$1,F19,LEFT(RemoveSpecChar(H19),20)))","v":5},"Hide",null,null,null,null,16]
[18,17,"Hide",99,6,6,{"$f":"IF(G$8+0.5>F20,F20,\"\")","v":""},null,null,null,null,{"$f":"IF(K20=\"Participant\",E20&\"_\"&LEFT(RemoveSpecChar(H20),20),IF(LEFT(RemoveSpecChar(H20),20)=$F$1,F20,LEFT(RemoveSpecChar(H20),20)))","v":6},"Hide",null,null,null,null,17]
{"$rows_left_out":366}
{"sheet":"Mall","index":1,"n_rows":165,"n_cols":21,"rows_kept":165,"cut":false,"hidden":true,"merged":[[144,20,144,35],[149,20,149,35],[150,20,150,35],[155,19,156,19],[145,17,145,18],[146,17,146,18],[147,17,147,18],[148,17,148,18],[150,17,150,18],[149,17,149,18],[151,17,151,18],[152,17,152,18],[153,17,153,18],[154,17,154,18],[142,17,142,18],[162,4,162,15],[163,4,163,15],[148,4,148,15],[149,4,149,15],[150,5,151,15],[155,17,156,18],[143,17,143,25],[145,20,145,35],[146,20,146,35],[147,20,147,35],[148,20,148,35],[151,20,151,35],[152,20,152,35],[153,20,153,35],[154,20,154,35],[1,5,2,11],[1,12,1,20],[2,12,2,16],[2,18,2,19],[2,20,7,20],[3,5,3,11],[3,12,3,16],[3,19,7,19],[4,10,4,11],[4,16,7,16],[5,7,6,11],[143,2,143,3],[145,4,145,15],[146,4,146,15],[118,2,119,2],[118,3,119,3],[118,12,119,12],[153,2,153,3],[160,2,160,3],[147,4,147,15],[156,4,156,15],[155,4,155,15],[3,2,4,3],[3,17,7,17],[3,18,7,18],[4,14,7,14],[4,15,7,15],[4,5,7,5],[4,6,7,6],[4,7,4,9],[4,12,7,12],[4,13,7,13],[120,1,139,1],[17,2,20,3],[118,10,119,10],[118,11,119,11],[118,4,118,9]]}
[{"$f":"Configuration!K16","v":"Participant"}]
[{"$f":"Configuration!G11","v":36},null,null,null,null,"Estimated expenditure",null,null,null,null,null,null,"Estimated Income"]
["J",null,null,null,null,null,null,null,null,null,null,null,"Requested EU contibution",null,null,null,null,"Revenues","Other cources of fincancing",null,"Total estimated income"]
["L",null,"Associated Partners can't request funding from HEU",null,null,"Estimated eligible costs",null,null,null,null,null,null,"EU contribution to eligible costs",null,null,null,null,"Income generated by the action","Financial contributions","Own resources"]
["M",null,null,null,null,"Personnel costs/€","Subcontracting costs/€","Purchase costs",null,null,"Other cost categories",null,"Indirect costs(€","Total eliqble costs","Funding rate","Maximun EU contribution to eliquble costs/€ (requested grant amount)","Requested EU contribution to eliqble costs/€ (requested grant amount)"]
[null,null,null,null,null,null,null,"Purchase costs"]
[]
[null,null,"No","Participant name","Country",null,null,"Travel and subsistence/€","Equipment/€","Other goods, works and services/€","Internal invoicing for goods and services","Finanical support to 3rd parties"]
[null,null,{"$f":"Configuration!F16","v":2},{"$f":"Configuration!H16","v":2},{"$f":"Configuration!I16","v":3},{"$f":"M141","v":0},{"$f":"D165","v":0},{"$f":"D146","v":0},{"$f":"D147","v":0},{"$f":"D150+D148+D149","v":0},{"$f":"D156","v":0},{"$f":"D157","v":0},{"$f":"0.25*(F9+H9+I9+J9)","v":0},{"$f":"F9+G9+H9+I9+J9+K9+M9","v":0},1,{"$f":"O9*N9","v":0},null,null,null,null,{"$f":"Q9+R9+S9+T9","v":0}]
[]
[null,null,null,null,null,null,null,null,null,null,null,null,null,null,"Remember to  update the following fields"]
[null,null,null,null,null,null,null,null,null,null,null,null,null,null,"* Funding rate"]
[null,null,null,null,null,null,null,null,null,null,null,null,null,null,"* Requested EU contribution"]
[null,null,null,null,null,null,null,null,null,null,null,null,null,null,"* Income Generated by the action"]
[null,null,null,null,null,null,null,null,null,null,null,null,null,null,"* Own resources"]
[]
[]
[null,null,"Personnel costs/€"]
[]
[]
{"$rows_left_out":146}
{"sheet":"Overview","index":2,"n_rows":501,"n_cols":30,"rows_kept":501,"cut":false,"hidden":false,"merged":[[5,4,6,9],[117,3,117,5],[11,6,12,15],[11,16,11,21],[12,16,12,17],[12,19,12,20],[12,21,17,21],[13,6,13,15],[13,16,13,17],[13,18,17,18],[13,19,17,19],[13,20,17,20],[14,6,17,6],[14,15,17,15],[14,16,17,16],[14,7,17,7],[14,23,14,28],[14,8,14,10],[14,11,14,12],[14,13,17,13],[14,14,17,14],[14,17,17,17]]}
[{"$f":"Configuration!K17","v":"Participant"}]
[{"$f":"Configuration!G11","v":36}]
["AC"]
["AD"]
[]
[null,null,null,null,"All changes are to be done on the corresponding partner page"]
["K"]
[]
[null,null,3]
[]
[]
[null,null,null,null,null,null,"Estimated expenditure",null,null,null,null,null,null,null,null,null,"Estimated Income"]
[null,null,null,null,null,null,null,null,null,null,null,null,null,null,null,null,"Requested EU contibution",null,"Revenues","Other cources of fincancing",null,"Total estimated income"]
[null,null,null,null,null,null,"Estimated eligible costs",null,null,null,null,null,null,null,null,null,"EU contribution to eligible costs",null,"Income generated by the action","Financial contributions","Own resources"]
[null,null,null,null,null,null,"Personnel costs/€","Subcontracting costs/€","Purchase costs",null,null,"Other cost categories",null,"Indirect costs(€","Total eliqble costs","Funding rate","Maximun EU contribution to eliquble costs/€ (requested grant amount)","Requested EU contribution to eliqble costs/€ (requested grant amount)",null,null,null,null,null,"Work Packages"]
[]
[null,null,null,null,null,null,null,null,"Purchase costs"]
[null,null,null,"No","Participant name","Country",null,null,"Travel and subsistence/€","Equipment/€","Other goods, works and services/€","Internal invoicing for goods and services","Finanical support to 3rd parties",null,null,null,null,null,null,null,null,null,null,"WP 1","WP 2","WP 3","WP 4","WP 5","WP 6","Total PM"]
[4,{"$f":"IF(Configuration!G15=Configuration!F15,99,0)","v":99},null,{"$f":"IF(ISBLANK(Configuration!G15),\"\",Configuration!G15)","v":1},{"$f":"IF(ISBLANK(Configuration!H15),\"\",Configuration!H15)","v":"tes1"},{"$f":"IF(ISBLANK(Configuration!I15),\"\",Configuration!I15)","v":2},{"$f":"'1_tes1'!F9","v":800},{"$f":"'1_tes1'!G9","v":0},{"$f":"'1_tes1'!H9","v":90000},{"$f":"'1_tes1'!I9","v":0},{"$f":"'1_tes1'!J9","v":0},{"$f":"'1_tes1'!K9","v":0},{"$f":"'1_tes1'!L9","v":0},{"$f":"'1_tes1'!M9","v":22700},{"$f":"'1_tes1'!N9","v":113500},{"$f":"'1_tes1'!O9","v":1},{"$f":"'1_tes1'!P9","v":113500},{"$f":"'1_tes1'!Q9","v":0},{"$f":"'1_tes1'!R9","v":0},{"$f":"'1_tes1'!S9","v":0},{"$f":"'1_tes1'!T9","v":0},{"$f":"'1_tes1'!U9","v":0},null,{"$f":"'1_tes1'!E141","v":1},{"$f":"'1_tes1'!F141","v":2},{"$f":"'1_tes1'!G141","v":0},{"$f":"'1_tes1'!H141","v":5},{"$f":"'1_tes1'!I141","v":0},{"$f":"'1_tes1'!J141","v":0},{"$f":"SUM(X19:AC19)","v":8}]
[5,{"$f":"IF(Configuration!G16=Configuration!F16,99,0)","v":99},null,{"$f":"IF(ISBLANK(Configuration!G16),\"\",Configuration!G16)","v":2},{"$f":"IF(ISBLANK(Configuration!H16),\"\",Configuration!H16)","v":2},{"$f":"IF(ISBLANK(Configuration!I16),\"\",Configuration!I16)","v":3},{"$f":"'2_2'!F9","v":0},{"$f":"'2_2'!G9","v":0},{"$f":"'2_2'!H9","v":0},{"$f":"'2_2'!I9","v":0},{"$f":"'2_2'!J9","v":0},{"$f":"'2_2'!K9","v":0},{"$f":"'2_2'!L9","v":0},{"$f":"'2_2'!M9","v":0},{"$f":"'2_2'!N9","v":0},{"$f":"'2_2'!O9","v":1},{"$f":"'2_2'!P9","v":0},{"$f":"'2_2'!Q9","v":0},{"$f":"'2_2'!R9","v":0},{"$f":"'2_2'!S9","v":0},{"$f":"'2_2'!T9","v":0},{"$f":"'2_2'!U9","v":0},null,{"$f":"'2_2'!E141","v":0},{"$f":"'2_2'!F141","v":0},{"$f":"'2_2'!G141","v":0},{"$f":"'2_2'!H141","v":0},{"$f":"'2_2'!I141","v":0},{"$f":"'2_2'!J141","v":0},{"$f":"SUM(X20:AC20)","v":0}]
{"$rows_left_out":482}
{"sheet":"1_tes1","index":3,"n_rows":165,"n_cols":21,"rows_kept":165,"cut":false,"hidden":false,"merged":[[163,4,163,15],[155,4,155,15],[155,17,156,18],[155,19,156,19],[156,4,156,15],[160,2,160,3],[162,4,162,15],[152,17,152,18],[152,20,152,35],[153,2,153,3],[153,17,153,18],[153,20,153,35],[154,17,154,18],[154,20,154,35],[149,4,149,15],[149,17,149,18],[149,20,149,35],[150,5,151,15],[150,17,150,18],[150,20,150,35],[151,17,151,18],[151,20,151,35],[147,4,147,15],[147,17,147,18],[147,20,147,35],[148,4,148,15],[148,17,148,18],[148,20,148,35],[145,4,145,15],[145,17,145,18],[145,20,145,35],[146,4,146,15],[146,17,146,18],[146,20,146,35],[118,12,119,12],[120,1,139,1],[142,17,142,18],[143,2,143,3],[143,17,143,25],[144,20,144,35],[5,7,6,11],[17,2,20,3],[118,2,119,2],[118,3,119,3],[118,4,118,9],[118,10,119,10],[118,11,119,11],[3,19,7,19],[4,5,7,5],[4,6,7,6],[4,7,4,9],[4,10,4,11],[4,12,7,12],[4,13,7,13],[4,14,7,14],[1,5,2,11],[1,12,1,20],[2,12,2,16],[2,18,2,19],[2,20,7,20],[3,2,4,3],[3,5,3,11],[3,12,3,16],[3,17,7,17],[3,18,7,18],[4,15,7,15],[4,16,7,16]]}
[{"$f":"Configuration!K15","v":"Participant"}]
[{"$f":"Configuration!G11","v":36},null,null,null,null,"Estimated expenditure",null,null,null,null,null,null,"Estimated Income"]
["J",null,null,null,null,null,null,null,null,null,null,null,"Requested EU contibution",null,null,null,null,"Revenues","Other cources of fincancing",null,"Total estimated income"]
["L",null,"Associated Partners can't request funding from HEU",null,null,"Estimated eligible costs",null,null,null,null,null,null,"EU contribution to eligible costs",null,null,null,null,"Income generated by the action","Financial contributions","Own resources"]
["M",null,null,null,null,"Personnel costs/€","Subcontracting costs/€","Purchase costs",null,null,"Other cost categories",null,"Indirect costs(€","Total eliqble costs","Funding rate","Maximun EU contribution to eliquble costs/€ (requested grant amount)","Requested EU contribution to eliqble costs/€ (requested grant amount)"]
[null,null,null,null,null,null,null,"Purchase costs"]
[]
[null,null,"No","Participant name","Country",null,null,"Travel and subsistence/€","Equipment/€","Other goods, works and services/€","Internal invoicing for goods and services","Finanical support to 3rd parties"]
[null,null,{"$f":"Configuration!F15","v":1},{"$f":"Configuration!H15","v":"tes1"},{"$f":"Configuration!I15","v":2},{"$f":"M141","v":800},{"$f":"D165","v":0},{"$f":"D146","v":90000},{"$f":"D147","v":0},{"$f":"D150+D148+D149","v":0},{"$f":"D156","v":0},{"$f":"D157","v":0},{"$f":"0.25*(F9+H9+I9+J9)","v":22700},{"$f":"F9+G9+H9+I9+J9+K9+M9","v":113500},1,{"$f":"O9*N9","v":113500},null,null,null,null,{"$f":"Q9+R9+S9+T9","v":0}]
[]
[null,null,null,null,null,null,null,null,null,null,null,null,null,null,"Remember to  update the following fields"]
[null,null,null,null,null,null,null,null,null,null,null,null,null,null,"* Funding rate"]
[null,null,null,null,null,null,null,null,null,null,null,null,null,null,"* Requested EU contribution"]
[null,null,null,null,null,null,null,null,null,null,null,null,null,null,"* Income Generated by the action"]
[null,null,null,null,null,null,null,null,null,null,null,null,null,null,"* Own resources"]
[]
[]
[null,null,"Personnel costs/€"]
[]
[]
{"$rows_left_out":146}
{"sheet":"2_2","index":4,"n_rows":165,"n_cols":21,"rows_kept":165,"cut":false,"hidden":false,"merged":[[163,4,163,15],[155,4,155,15],[155,17,156,18],[155,19,156,19],[156,4,156,15],[160,2,160,3],[162,4,162,15],[152,17,152,18],[152,20,152,35],[153,2,153,3],[153,17,153,18],[153,20,153,35],[154,17,154,18],[154,20,154,35],[149,4,149,15],[149,17,149,18],[149,20,149,35],[150,5,151,15],[150,17,150,18],[150,20,150,35],[151,17,151,18],[151,20,151,35],[147,4,147,15],[147,17,147,18],[147,20,147,35],[148,4,148,15],[148,17,148,18],[148,20,148,35],[145,4,145,15],[145,17,145,18],[145,20,145,35],[146,4,146,15],[146,17,146,18],[146,20,146,35],[118,12,119,12],[120,1,139,1],[142,17,142,18],[143,2,143,3],[143,17,143,25],[144,20,144,35],[5,7,6,11],[17,2,20,3],[118,2,119,2],[118,3,119,3],[118,4,118,9],[118,10,119,10],[118,11,119,11],[3,19,7,19],[4,5,7,5],[4,6,7,6],[4,7,4,9],[4,10,4,11],[4,12,7,12],[4,13,7,13],[4,14,7,14],[1,5,2,11],[1,12,1,20],[2,12,2,16],[2,18,2,19],[2,20,7,20],[3,2,4,3],[3,5,3,11],[3,12,3,16],[3,17,7,17],[3,18,7,18],[4,15,7,15],[4,16,7,16]]}
[{"$f":"Configuration!K16","v":"Participant"}]
[{"$f":"Configuration!G11","v":36},null,null,null,null,"Estimated expenditure",null,null,null,null,null,null,"Estimated Income"]
["J",null,null,null,null,null,null,null,null,null,null,null,"Requested EU contibution",null,null,null,null,"Revenues","Other cources of fincancing",null,"Total estimated income"]
["L",null,"Associated Partners can't request funding from HEU",null,null,"Estimated eligible costs",null,null,null,null,null,null,"EU contribution to eligible costs",null,null,null,null,"Income generated by the action","Financial contributions","Own resources"]
["M",null,null,null,null,"Personnel costs/€","Subcontracting costs/€","Purchase costs",null,null,"Other cost categories",null,"Indirect costs(€","Total eliqble costs","Funding rate","Maximun EU contribution to eliquble costs/€ (requested grant amount)","Requested EU contribution to eliqble costs/€ (requested grant amount)"]
[null,null,null,null,null,null,null,"Purchase costs"]
[]
[null,null,"No","Participant name","Country",null,null,"Travel and subsistence/€","Equipment/€","Other goods, works and services/€","Internal invoicing for goods and services","Finanical support to 3rd parties"]
[null,null,{"$f":"Configuration!F16","v":2},{"$f":"Configuration!H16","v":2},{"$f":"Configuration!I16","v":3},{"$f":"M141","v":0},{"$f":"D165","v":0},{"$f":"D146","v":0},{"$f":"D147","v":0},{"$f":"D150+D148+D149","v":0},{"$f":"D156","v":0},{"$f":"D157","v":0},{"$f":"0.25*(F9+H9+I9+J9)","v":0},{"$f":"F9+G9+H9+I9+J9+K9+M9","v":0},1,{"$f":"O9*N9","v":0},null,null,null,null,{"$f":"Q9+R9+S9+T9","v":0}]
[]
[null,null,null,null,null,null,null,null,null,null,null,null,null,null,"Remember to  update the following fields"]
[null,null,null,null,null,null,null,null,null,null,null,null,null,null,"* Funding rate"]
[null,null,null,null,null,null,null,null,null,null,null,null,null,null,"* Requested EU contribution"]
[null,null,null,null,null,null,null,null,null,null,null,null,null,null,"* Income Generated by the action"]
[null,null,null,null,null,null,null,null,null,null,null,null,null,null,"* Own resources"]
[]
[]
[null,null,"Personnel costs/€"]
[]
[]
{"$rows_left_out":146}
{"sheet":"3_3","index":5,"n_rows":165,"n_cols":21,"rows_kept":165,"cut":false,"hidden":false,"merged":[[3,2,4,3],[3,5,3,11],[3,12,3,16],[3,17,7,17],[3,18,7,18],[4,15,7,15],[4,16,7,16],[1,5,2,11],[1,12,1,20],[2,12,2,16],[2,18,2,19],[2,20,7,20],[144,20,144,35],[5,7,6,11],[17,2,20,3],[118,2,119,2],[118,3,119,3],[118,4,118,9],[118,10,119,10],[118,11,119,11],[3,19,7,19],[4,5,7,5],[4,6,7,6],[4,7,4,9],[4,10,4,11],[4,12,7,12],[4,13,7,13],[4,14,7,14],[118,12,119,12],[120,1,139,1],[142,17,142,18],[143,2,143,3],[143,17,143,25],[145,4,145,15],[145,17,145,18],[145,20,145,35],[146,4,146,15],[146,17,146,18],[146,20,146,35],[147,4,147,15],[147,17,147,18],[147,20,147,35],[148,4,148,15],[148,17,148,18],[148,20,148,35],[149,4,149,15],[149,17,149,18],[149,20,149,35],[150,5,151,15],[150,17,150,18],[150,20,150,35],[151,17,151,18],[151,20,151,35],[160,2,160,3],[162,4,162,15],[152,17,152,18],[152,20,152,35],[153,2,153,3],[153,17,153,18],[153,20,153,35],[154,17,154,18],[154,20,154,35],[163,4,163,15],[155,4,155,15],[155,17,156,18],[155,19,156,19],[156,4,156,15]]}
[{"$f":"Configuration!K17","v":"Participant"}]
[{"$f":"Configuration!G11","v":36},null,null,null,null,"Estimated expenditure",null,null,null,null,null,null,"Estimated Income"]
["J",null,null,null,null,null,null,null,null,null,null,null,"Requested EU contibution",null,null,null,null,"Revenues","Other cources of fincancing",null,"Total estimated income"]
["L",null,"Associated Partners can't request funding from HEU",null,null,"Estimated eligible costs",null,null,null,null,null,null,"EU contribution to eligible costs",null,null,null,null,"Income generated by the action","Financial contributions","Own resources"]
["M",null,null,null,null,"Personnel costs/€","Subcontracting costs/€","Purchase costs",null,null,"Other cost categories",null,"Indirect costs(€","Total eliqble costs","Funding rate","Maximun EU contribution to eliquble costs/€ (requested grant amount)","Requested EU contribution to eliqble costs/€ (requested grant amount)"]
[null,null,null,null,null,null,null,"Purchase costs"]
[]
[null,null,"No","Participant name","Country",null,null,"Travel and subsistence/€","Equipment/€","Other goods, works and services/€","Internal invoicing for goods and services","Finanical support to 3rd parties"]
[null,null,{"$f":"Configuration!F17","v":3},{"$f":"Configuration!H17","v":3},{"$f":"Configuration!I17","v":3},{"$f":"M141","v":0},{"$f":"D165","v":0},{"$f":"D146","v":0},{"$f":"D147","v":0},{"$f":"D150+D148+D149","v":0},{"$f":"D156","v":0},{"$f":"D157","v":0},{"$f":"0.25*(F9+H9+I9+J9)","v":0},{"$f":"F9+G9+H9+I9+J9+K9+M9","v":0},1,{"$f":"O9*N9","v":0},null,null,null,null,{"$f":"Q9+R9+S9+T9","v":0}]
[]
[null,null,null,null,null,null,null,null,null,null,null,null,null,null,"Remember to  update the following fields"]
[null,null,null,null,null,null,null,null,null,null,null,null,null,null,"* Funding rate"]
[null,null,null,null,null,null,null,null,null,null,null,null,null,null,"* Requested EU contribution"]
[null,null,null,null,null,null,null,null,null,null,null,null,null,null,"* Income Generated by the action"]
[null,null,null,null,null,null,null,null,null,null,null,null,null,null,"* Own resources"]
[]
[]
[null,null,"Personnel costs/€"]
[]
[]
{"$rows_left_out":145}